Jump to content
  • 0

Gamefile Source compile


dukaibalu1

Question

Recommended Posts

  • 0
  • Former Staff

search for this in make file

LIBS += -lmysqlclient -lz

and above it write this

LIBDIR += -L/usr/local/lib/mysql

this was for the first problem

Edited by flygun
Link to comment
Share on other sites

  • 0

search for this in make file

LIBS += -lmysqlclient -lz

and above it write this

LIBDIR += -L/usr/local/lib/mysql

this was for the first problem

 

This problem has been resolved. But thank you.

I have written to our second problem

 

dukaibalu1

Link to comment
Share on other sites

  • 0

 

Open makefile search for :

g++


and replace with :

g++49
or
g++48

Depend what gcc you have installed.

 

g++48

f13e750d36.png

 

Search in makefile game for all :

-mcpu

Replace all -mcpu with:

-march
Edited by Metin2 Dev
Core X - External 2 Internal
  • Love 2
Link to comment
Share on other sites

  • 0

252ff3c5bb.png

 

new problem :/

Could you possibly help more?

 

 

../../../Extern/include/cryptopp/secblock.h:91:14: error: 'CheckSize' was not declared in this scope, and no declarations were found by argument-dependent lookup at the point of instantiation [-fpermissive]
   CheckSize(n);
Edited by Metin2 Dev
Core X - External 2 Internal
Link to comment
Share on other sites

  • 0
gmake
compile cipher.cpp
In file included from ../../../Extern/include/cryptopp/secblock.h:7:0,
                 from ../../../Extern/include/cryptopp/modes.h:8,
                 from cipher.cpp:7:
../../../Extern/include/cryptopp/algparam.h: In instantiation of 'CryptoPP::ConstByteArrayParameter::ConstByteArrayParameter(const T&, bool) [with T = std::basic_string<char>]':
../../../Extern/include/cryptopp/filters.h:793:132:   required from here
../../../Extern/include/cryptopp/misc.h:58:118: warning: unused variable 'cryptopp_assert_26' [-Wunused-variable]
 #define CRYPTOPP_COMPILE_ASSERT_INSTANCE(assertion, instance) static CompileAssert<(assertion)> CRYPTOPP_ASSERT_JOIN(cryptopp_assert_, instance)
                                                                                                                      ^
../../../Extern/include/cryptopp/misc.h:61:39: note: in definition of macro 'CRYPTOPP_DO_ASSERT_JOIN'
 #define CRYPTOPP_DO_ASSERT_JOIN(X, Y) X##Y
                                       ^
../../../Extern/include/cryptopp/misc.h:58:97: note: in expansion of macro 'CRYPTOPP_ASSERT_JOIN'
 #define CRYPTOPP_COMPILE_ASSERT_INSTANCE(assertion, instance) static CompileAssert<(assertion)> CRYPTOPP_ASSERT_JOIN(cryptopp_assert_, instance)
                                                                                                 ^
../../../Extern/include/cryptopp/misc.h:54:44: note: in expansion of macro 'CRYPTOPP_COMPILE_ASSERT_INSTANCE'
 #define CRYPTOPP_COMPILE_ASSERT(assertion) CRYPTOPP_COMPILE_ASSERT_INSTANCE(assertion, __LINE__)
                                            ^
../../../Extern/include/cryptopp/algparam.h:26:9: note: in expansion of macro 'CRYPTOPP_COMPILE_ASSERT'
         CRYPTOPP_COMPILE_ASSERT(sizeof(CPP_TYPENAME T::value_type) == 1);
         ^
In file included from ../../../Extern/include/cryptopp/modes.h:8:0,
                 from cipher.cpp:7:
../../../Extern/include/cryptopp/secblock.h: In instantiation of 'CryptoPP::AllocatorWithCleanup<T, T_Align16>::pointer CryptoPP::AllocatorWithCleanup<T, T_Align16>::allocate(CryptoPP::AllocatorWithCleanup<T, T_Align16>::size_type, const void*) [with T = unsigned char; bool T_Align16 = false; CryptoPP::AllocatorWithCleanup<T, T_Align16>::pointer = unsigned char*; CryptoPP::AllocatorWithCleanup<T, T_Align16>::size_type = unsigned int]':
../../../Extern/include/cryptopp/secblock.h:247:25:   required from 'CryptoPP::SecBlock<T, A>::SecBlock(CryptoPP::SecBlock<T, A>::size_type) [with T = unsigned char; A = CryptoPP::AllocatorWithCleanup<unsigned char>; CryptoPP::SecBlock<T, A>::size_type = unsigned int]'
../../../Extern/include/cryptopp/algparam.h:17:2:   required from here
../../../Extern/include/cryptopp/secblock.h:91:14: error: 'CheckSize' was not declared in this scope, and no declarations were found by argument-dependent lookup at the point of instantiation [-fpermissive]
   CheckSize(n);
              ^
../../../Extern/include/cryptopp/secblock.h:91:14: note: declarations in dependent base 'CryptoPP::AllocatorBase<unsigned char>' are not found by unqualified lookup
../../../Extern/include/cryptopp/secblock.h:91:14: note: use 'this->CheckSize' instead
../../../Extern/include/cryptopp/secblock.h: In instantiation of 'CryptoPP::AllocatorWithCleanup<T, T_Align16>::pointer CryptoPP::AllocatorWithCleanup<T, T_Align16>::allocate(CryptoPP::AllocatorWithCleanup<T, T_Align16>::size_type, const void*) [with T = unsigned char; bool T_Align16 = true; CryptoPP::AllocatorWithCleanup<T, T_Align16>::pointer = unsigned char*; CryptoPP::AllocatorWithCleanup<T, T_Align16>::size_type = unsigned int]':
../../../Extern/include/cryptopp/secblock.h:247:25:   required from 'CryptoPP::SecBlock<T, A>::SecBlock(CryptoPP::SecBlock<T, A>::size_type) [with T = unsigned char; A = CryptoPP::AllocatorWithCleanup<unsigned char, true>; CryptoPP::SecBlock<T, A>::size_type = unsigned int]'
../../../Extern/include/cryptopp/modes.h:63:34:   required from here
../../../Extern/include/cryptopp/secblock.h:91:14: error: 'CheckSize' was not declared in this scope, and no declarations were found by argument-dependent lookup at the point of instantiation [-fpermissive]
../../../Extern/include/cryptopp/secblock.h:91:14: note: declarations in dependent base 'CryptoPP::AllocatorBase<unsigned char>' are not found by unqualified lookup
../../../Extern/include/cryptopp/secblock.h:91:14: note: use 'this->CheckSize' instead
../../../Extern/include/cryptopp/secblock.h: In instantiation of 'CryptoPP::AllocatorWithCleanup<T, T_Align16>::pointer CryptoPP::AllocatorWithCleanup<T, T_Align16>::allocate(CryptoPP::AllocatorWithCleanup<T, T_Align16>::size_type, const void*) [with T = unsigned int; bool T_Align16 = true; CryptoPP::AllocatorWithCleanup<T, T_Align16>::pointer = unsigned int*; CryptoPP::AllocatorWithCleanup<T, T_Align16>::size_type = unsigned int]':
../../../Extern/include/cryptopp/secblock.h:249:29:   required from 'CryptoPP::SecBlock<T, A>::SecBlock(const CryptoPP::SecBlock<T, A>&) [with T = unsigned int; A = CryptoPP::AllocatorWithCleanup<unsigned int, true>]'
../../../Extern/include/cryptopp/modarith.h:122:20:   required from here
../../../Extern/include/cryptopp/secblock.h:91:14: error: 'CheckSize' was not declared in this scope, and no declarations were found by argument-dependent lookup at the point of instantiation [-fpermissive]
../../../Extern/include/cryptopp/secblock.h:91:14: note: declarations in dependent base 'CryptoPP::AllocatorBase<unsigned int>' are not found by unqualified lookup
../../../Extern/include/cryptopp/secblock.h:91:14: note: use 'this->CheckSize' instead
In file included from ../../../Extern/include/cryptopp/modes.h:12:0,
                 from cipher.cpp:7:
../../../Extern/include/cryptopp/algparam.h: In instantiation of 'void CryptoPP::AlgorithmParametersTemplate<T>::MoveInto(void*) const [with T = CryptoPP::RandomNumberGenerator*]':
cipher.cpp:398:1:   required from here
../../../Extern/include/cryptopp/algparam.h:322:35: warning: unused variable 'p' [-Wunused-variable]
   AlgorithmParametersTemplate<T>* p = new(buffer) AlgorithmParametersTemplate<T>(*this);
                                   ^
In file included from ../../../Extern/include/cryptopp/modes.h:8:0,
                 from cipher.cpp:7:
../../../Extern/include/cryptopp/secblock.h: In instantiation of 'CryptoPP::AllocatorWithCleanup<T, T_Align16>::pointer CryptoPP::AllocatorWithCleanup<T, T_Align16>::allocate(CryptoPP::AllocatorWithCleanup<T, T_Align16>::size_type, const void*) [with T = unsigned int; bool T_Align16 = false; CryptoPP::AllocatorWithCleanup<T, T_Align16>::pointer = unsigned int*; CryptoPP::AllocatorWithCleanup<T, T_Align16>::size_type = unsigned int]':
../../../Extern/include/cryptopp/secblock.h:247:25:   required from 'CryptoPP::SecBlock<T, A>::SecBlock(CryptoPP::SecBlock<T, A>::size_type) [with T = unsigned int; A = CryptoPP::AllocatorWithCleanup<unsigned int>; CryptoPP::SecBlock<T, A>::size_type = unsigned int]'
../../../Extern/include/cryptopp/rc5.h:22:27:   required from 'CryptoPP::BlockCipherFinal<DIR, BASE>::BlockCipherFinal() [with CryptoPP::CipherDir DIR = (CryptoPP::CipherDir)0u; BASE = CryptoPP::RC5::Enc]'
../../../Extern/include/cryptopp/misc.h:82:7:   required from 'CryptoPP::CipherModeFinalTemplate_CipherHolder<CIPHER, BASE>::CipherModeFinalTemplate_CipherHolder(const byte*, size_t, const byte*) [with CIPHER = CryptoPP::BlockCipherFinal<(CryptoPP::CipherDir)0u, CryptoPP::RC5::Enc>; BASE = CryptoPP::ConcretePolicyHolder<CryptoPP::Empty, CryptoPP::AdditiveCipherTemplate<CryptoPP::AbstractPolicyHolder<CryptoPP::AdditiveCipherAbstractPolicy, CryptoPP::CTR_ModePolicy> > >; byte = unsigned char; size_t = unsigned int]'
cipher.cpp:88:64:   required from 'CryptoPP::SymmetricCipher* BlockCipherDetail<T>::CreateEncoder(const byte*, size_t, const byte*) const [with T = CryptoPP::RC5; byte = unsigned char; size_t = unsigned int]'
cipher.cpp:398:1:   required from here
../../../Extern/include/cryptopp/secblock.h:91:14: error: 'CheckSize' was not declared in this scope, and no declarations were found by argument-dependent lookup at the point of instantiation [-fpermissive]
   CheckSize(n);
              ^
../../../Extern/include/cryptopp/secblock.h:91:14: note: declarations in dependent base 'CryptoPP::AllocatorBase<unsigned int>' are not found by unqualified lookup
../../../Extern/include/cryptopp/secblock.h:91:14: note: use 'this->CheckSize' instead
In file included from ../../../Extern/include/cryptopp/secblock.h:7:0,
                 from ../../../Extern/include/cryptopp/modes.h:8,
                 from cipher.cpp:7:
../../../Extern/include/cryptopp/misc.h:548:20: warning: 'std::string CryptoPP::StringNarrow(const wchar_t*, bool)' defined but not used [-Wunused-function]
 static std::string StringNarrow(const wchar_t *str, bool throwOnError = true)
                    ^
Makefile:133: recipe for target 'OBJDIR/cipher.o' failed
gmake: *** [OBJDIR/cipher.o] Error 1

Link to comment
Share on other sites

Create an account or sign in to comment

You need to be a member in order to leave a comment

Create an account

Sign up for a new account in our community. It's easy!

Register a new account

Sign in

Already have an account? Sign in here.

Sign In Now


  • Activity

    1. 7

      Metin2 2003 Beta Client!!!!!

    2. 32

      Boss Effect Over Head

    3. 1

      Open Source API for Metin2 Server Management - Early Development

    4. 0

      Official Item Combination [18.4]

    5. 2

      Proper SIGNAL management for Windows

    6. 2

      Proper SIGNAL management for Windows

    7. 4

      syserr erorr ( not working OK button on client )

  • Recently Browsing

    • No registered users viewing this page.
×
×
  • Create New...

Important Information

Terms of Use / Privacy Policy / Guidelines / We have placed cookies on your device to help make this website better. You can adjust your cookie settings, otherwise we'll assume you're okay to continue.