Jump to content
×
×
  • Create New...
  • 0

Errors


fenixplayscz

Question

How to fix??

compile BattleArena.cpp
compile FSM.cpp
compile MarkConvert.cpp
compile MarkImage.cpp
compile MarkManager.cpp
compile OXEvent.cpp
compile TrafficProfiler.cpp
compile ani.cpp
compile arena.cpp
compile banword.cpp
compile battle.cpp
compile blend_item.cpp
compile block_country.cpp
compile buffer_manager.cpp
compile building.cpp
compile castle.cpp
compile char.cpp
compile char_affect.cpp
compile char_battle.cpp
compile char_change_empire.cpp
In file included from char.cpp:4:
../../common/VnumHelper.h:59:32: warning: no newline at end of file
compile char_horse.cpp
In file included from char.cpp:25:
shop_manager.h:40:7: warning: no newline at end of file
In file included from char.cpp:62:
PetSystem.h:163:31: warning: no newline at end of file
char.cpp:7221: warning: this decimal constant is unsigned only in ISO C90
compile char_item.cpp
compile char_manager.cpp
In file included from char_battle.cpp:27:
shop_manager.h:40:7: warning: no newline at end of file
compile char_quickslot.cpp
In file included from char_horse.cpp:14:
../../common/VnumHelper.h:59:32: warning: no newline at end of file
compile char_resist.cpp
compile char_skill.cpp
compile char_state.cpp
compile PetSystem.cpp
compile cmd.cpp
compile cmd_emotion.cpp
In file included from char_item.cpp:44:
../../common/VnumHelper.h:59:32: warning: no newline at end of file
In file included from char_item.cpp:47:
belt_inventory_helper.h:108:42: warning: no newline at end of file
compile cmd_general.cpp
In file included from char_state.cpp:25:
../../common/VnumHelper.h:59:32: warning: no newline at end of file
compile cmd_gm.cpp
compile cmd_oxevent.cpp
compile config.cpp
compile constants.cpp
In file included from PetSystem.cpp:8:
PetSystem.h:163:31: warning: no newline at end of file
In file included from PetSystem.cpp:9:
../../common/VnumHelper.h:59:32: warning: no newline at end of file
PetSystem.cpp:637:2: warning: no newline at end of file
compile crc32.cpp
compile cube.cpp
In file included from cmd_general.cpp:36:
../../common/VnumHelper.h:59:32: warning: no newline at end of file
compile db.cpp
In file included from char.cpp:34:
guild.h:154: internal compiler error: Segmentation fault: 11
Please submit a full bug report,
with preprocessed source if appropriate.
See <URL:http://gcc.gnu.org/bugs.html> for instructions.
PetSystem.cpp: In member function 'virtual bool CPetActor::_UpdateFollowAI()':
PetSystem.cpp:246: warning: unused variable 'bDoMoveAlone'
PetSystem.cpp: In member function 'CPetActor* CPetSystem::Summon(DWORD, CItem*, const char*, bool, DWORD)':
PetSystem.cpp:552: warning: unused variable 'petVID'
check_server.h: In static member function 'static bool CheckServer::CheckIp(const char*)':
check_server.h:24: warning: comparison between signed and unsigned integer expressions
config.cpp: In function 'void config_init(const std::string&)':
config.cpp:435: warning: NULL used in arithmetic
config.cpp:459: warning: NULL used in arithmetic
config.cpp:483: warning: NULL used in arithmetic
config.cpp:505: warning: unused variable 'line'
config.cpp:1111: warning: overflow in implicit constant conversion
config.cpp:1112: warning: format '%d' expects type 'int', but argument 3 has type 'long long int'
constants.cpp:291: warning: this decimal constant is unsigned only in ISO C90
constants.cpp:292: warning: this decimal constant is unsigned only in ISO C90
constants.cpp:293: warning: this decimal constant is unsigned only in ISO C90
constants.cpp:294: warning: this decimal constant is unsigned only in ISO C90
constants.cpp:295: warning: this decimal constant is unsigned only in ISO C90
constants.cpp:296: warning: this decimal constant is unsigned only in ISO C90
constants.cpp:297: warning: this decimal constant is unsigned only in ISO C90
constants.cpp:298: warning: this decimal constant is unsigned only in ISO C90
constants.cpp:299: warning: this decimal constant is unsigned only in ISO C90
constants.cpp:300: warning: this decimal constant is unsigned only in ISO C90
constants.cpp:301: warning: this decimal constant is unsigned only in ISO C90
constants.cpp:302: warning: this decimal constant is unsigned only in ISO C90
constants.cpp:303: warning: this decimal constant is unsigned only in ISO C90
constants.cpp:304: warning: this decimal constant is unsigned only in ISO C90
constants.cpp:305: warning: this decimal constant is unsigned only in ISO C90
constants.cpp:306: warning: this decimal constant is unsigned only in ISO C90
constants.cpp:307: warning: this decimal constant is unsigned only in ISO C90
constants.cpp:308: warning: this decimal constant is unsigned only in ISO C90
constants.cpp:309: warning: this decimal constant is unsigned only in ISO C90
constants.cpp:310: warning: this decimal constant is unsigned only in ISO C90
constants.cpp:311: warning: this decimal constant is unsigned only in ISO C90
gmake: *** [OBJDIR/char.o] Error 1
gmake: *** Waiting for unfinished jobs....
/usr/include/c++/4.2/bits/stl_iterator.h: In instantiation of '__gnu_cxx::__normal_iterator<const wchar_t*, std::basic_string<wchar_t, std::char_traits<wchar_t>, std::allocator<wchar_t> > >':
../../../Extern/include/boost/functional/hash/hash.hpp:294:   instantiated from 'size_t boost::hash_value(const std::basic_string<Ch, std::char_traits<_CharT>, A>&) [with Ch = wchar_t, A = std::allocator<wchar_t>]'
../../../Extern/include/boost/functional/hash/hash.hpp:408:   instantiated from here
/usr/include/c++/4.2/bits/stl_iterator.h:660: internal compiler error: Segmentation fault: 11
Please submit a full bug report,
with preprocessed source if appropriate.
See <URL:http://gcc.gnu.org/bugs.html> for instructions.
belt_inventory_helper.h: In static member function 'static BYTE CBeltInventoryHelper::GetBeltGradeByRefineLevel(int)':
belt_inventory_helper.h:28: warning: comparison between signed and unsigned integer expressions
gmake: *** [OBJDIR/char_battle.o] Error 1
char_item.cpp: In member function 'bool CHARACTER::IsEmptyItemGrid(TItemPos, BYTE, int) const':
char_item.cpp:640: warning: comparison is always false due to limited range of data type
char_item.cpp:666: warning: comparison is always false due to limited range of data type
char_item.cpp: In member function 'bool CHARACTER::UseItemEx(CItem*, TItemPos)':
char_item.cpp:2387: warning: format '%d' expects type 'int', but argument 6 has type 'long int'
char_item.cpp:2391: warning: format '%d' expects type 'int', but argument 6 has type 'long int'
char_item.cpp:2403: warning: format '%d' expects type 'int', but argument 5 has type 'long int'
char_item.cpp:2407: warning: format '%d' expects type 'int', but argument 5 has type 'long int'
char_item.cpp:2434: warning: format '%d' expects type 'int', but argument 6 has type 'long int'
char_item.cpp:2442: warning: format '%d' expects type 'int', but argument 5 has type 'long int'
char_item.cpp:5087: warning: comparison between signed and unsigned integer expressions
char_item.cpp: In member function 'bool CHARACTER::UseItem(TItemPos, TItemPos)':
char_item.cpp:5159: warning: unused variable 'wDestCell'
char_item.cpp:5160: warning: unused variable 'bDestInven'
char_item.cpp: In member function 'bool CHARACTER::EquipItem(CItem*, int)':
char_item.cpp:6160: warning: array subscript has type 'char'
char_item.cpp: In member function 'void CHARACTER::BuffOnAttr_AddBuffsFromItem(CItem*)':
char_item.cpp:6224: warning: comparison between signed and unsigned integer expressions
char_item.cpp: In member function 'void CHARACTER::BuffOnAttr_RemoveBuffsFromItem(CItem*)':
char_item.cpp:6236: warning: comparison between signed and unsigned integer expressions
char_item.cpp: In member function 'bool CHARACTER::CanEquipNow(CItem*, const TItemPos&, const TItemPos&)':
char_item.cpp:7422: warning: unused variable 'itemType'
char_item.cpp:7423: warning: unused variable 'itemSubType'
cmd_gm.cpp: In function 'void do_set_stat(CHARACTER*, const char*, int, int)':
cmd_gm.cpp:3935: warning: NULL used in arithmetic
char_item.cpp: In member function 'bool CHARACTER::IsEmptyItemGrid(TItemPos, BYTE, int) const':
char_item.cpp:679: warning: control reaches end of non-void function
Segmentation fault (core dumped)
char_item.cpp: In member function 'void CHARACTER::BuffOnAttr_ValueChange(BYTE, BYTE, BYTE)':
char_item.cpp:6271: warning: 'pBuff' may be used uninitialized in this function
g++: Internal error: Segmentation fault: 11 (program cc1plus)
Please submit a full bug report.
See <URL:http://gcc.gnu.org/bugs.html> for instructions.
../../../Extern/include/boost/unordered/detail/fwd.hpp: In instantiation of 'boost::unordered_detail::hash_buckets<std::allocator<std::pair<const unsigned char, int> >, boost::unordered_detail::ungrouped>':
../../../Extern/include/boost/unordered/detail/fwd.hpp:1005:   instantiated from 'boost::unordered_detail::types<unsigned char, std::pair<const unsigned char, int>, boost::hash<unsigned char>, std::equal_to<unsigned char>, std::allocator<std::pair<const unsigned char, int> >, boost::unordered_detail::map_extractor<unsigned char, std::pair<const unsigned char, int> >, boost::unordered_detail::ungrouped>'
../../../Extern/include/boost/unordered/detail/fwd.hpp:1045:   instantiated from 'boost::unordered_detail::map<unsigned char, boost::hash<unsigned char>, std::equal_to<unsigned char>, std::allocator<std::pair<const unsigned char, int> > >'
../../../Extern/include/boost/unordered/unordered_map.hpp:63:   instantiated from 'boost::unordered_map<unsigned char, int, boost::hash<unsigned char>, std::equal_to<unsigned char>, std::allocator<std::pair<const unsigned char, int> > >'
char.h:1452:   instantiated from here
../../../Extern/include/boost/unordered/detail/fwd.hpp:286: internal compiler error: Segmentation fault: 11
Please submit a full bug report,
with preprocessed source if appropriate.
See <URL:http://gcc.gnu.org/bugs.html> for instructions.
cmd_gm.cpp: In function 'void do_use_item(CHARACTER*, const char*, int, int)':
cmd_gm.cpp:4357: warning: 'cell' may be used uninitialized in this function
cmd_gm.cpp: In function 'void do_set_stat(CHARACTER*, const char*, int, int)':
cmd_gm.cpp:3977: warning: 'n' may be used uninitialized in this function
cmd_gm.cpp: In function 'void do_mob_ld(CHARACTER*, const char*, int, int)':
cmd_gm.cpp:855: warning: 'x' may be used uninitialized in this function
cmd_gm.cpp:855: warning: 'y' may be used uninitialized in this function
char_state.cpp: In member function 'virtual void CHARACTER::StateMove()':
char_state.cpp:901: warning: unused variable 'rider'
char_skill.cpp:3601: internal compiler error: Segmentation fault: 11
Please submit a full bug report,
with preprocessed source if appropriate.
See <URL:http://gcc.gnu.org/bugs.html> for instructions.
char_item.cpp: At global scope:
char_item.cpp:7543: internal compiler error: Segmentation fault: 11
Please submit a full bug report,
with preprocessed source if appropriate.
See <URL:http://gcc.gnu.org/bugs.html> for instructions.

BUILD FAILED (exit value 139, total time: 2m 11s)
Link to comment
Share on other sites

  • Answers 4
  • Created
  • Last Reply

Top Posters For This Question

Popular Days

Top Posters For This Question

4 answers to this question

Recommended Posts

Create an account or sign in to comment

You need to be a member in order to leave a comment

Create an account

Sign up for a new account in our community. It's easy!

Register a new account

Sign in

Already have an account? Sign in here.

Sign In Now


  • Activity

    1. 2

      Problem freebsd

    2. 0

      Making chain quest

    3. 4

      Ludus2: a metin2-like browser game

    4. 6
    5. 9

      Help in implementing a switch bot

    6. 0

      Special Inventory System Can't Sell To Npc's

    7. 0

      ROV2.GLOBAL | International | Server start 14.05.2022

    8. 75

      Services - System Ard [C ++ / Python / Lua]

  • Recently Browsing

    • No registered users viewing this page.

Important Information

Terms of Use / Privacy Policy / Guidelines / We have placed cookies on your device to help make this website better. You can adjust your cookie settings, otherwise we'll assume you're okay to continue.