Jump to content

Recommended Posts

Hi.. Today i tried to add Offline Shop (Ken) but i have some error in compile :/

input_main.cpp: In member function 'int CInputMain::MyOfflineShop(CHARACTER*, const char*, size_t)':
input_main.cpp:3206: error: 'TPacketCGMyOfflineShop' was not declared in this scope
input_main.cpp:3206: error: 'p' was not declared in this scope
input_main.cpp:3206: error: expected primary-expression before ')' token
input_main.cpp:3206: error: expected `;' before 'c_pData'
gmake: *** [OBJDIR/input_main.o] Error 1
gmake: *** Waiting for unfinished jobs....

Here is input_main.cpp

Someone know ho to fix it ? :(

Link to comment
https://metin2.dev/topic/16713-offlineshop/
Share on other sites

  • Replies 1
  • Created
  • Last Reply

Top Posters In This Topic

Top Posters In This Topic

Don't use any images from : imgur, turkmmop, freakgamers, inforge, hizliresim... Or your content will be deleted without notice...
Use : https://metin2.download/media/add/

Please use https://metin2.download/ when uploading files smaller than 100MB, otherwise the approval will take longer due to manual upload.

Please sign in to comment

You will be able to leave a comment after signing in



Sign In Now
×
×
  • Create New...

Important Information

Terms of Use / Privacy Policy / Guidelines / We have placed cookies on your device to help make this website better. You can adjust your cookie settings, otherwise we'll assume you're okay to continue.