Jump to content
×
×
  • Create New...
  • 0

Compile problem VS 2013


DiabloxPL

Question

Hello.

I have a problem compilation...

I use Visual Studio 2013 !

UserInterface log:

1>------ Build started: Project: UserInterface, Configuration: Distribute Win32 ------


1>C:\Program Files (x86)\MSBuild\Microsoft.Cpp\v4.0\V120\Microsoft.CppBuild.targets(1193,5): warning MSB8012: TargetPath(E:\kraizy\mainline_released\mainline_sg\Srcs\Client\UserInterface\../bin\UserInterface.exe) does not match the Linker's OutputFile property value (E:\kraizy\mainline_released\mainline_sg\Srcs\Client\UserInterface\Distribute\metin2client.exe). This may cause your project to build incorrectly. To correct this, please make sure that $(OutDir), $(TargetName) and $(TargetExt) property values match the value specified in %(Link.OutputFile).
1>C:\Program Files (x86)\MSBuild\Microsoft.Cpp\v4.0\V120\Microsoft.CppBuild.targets(1195,5): warning MSB8012: TargetName(UserInterface) does not match the Linker's OutputFile property value (metin2client). This may cause your project to build incorrectly. To correct this, please make sure that $(OutDir), $(TargetName) and $(TargetExt) property values match the value specified in %(Link.OutputFile).
1>d3dx8.lib(d3dxmath.obj) : error LNK2026: module unsafe for SAFESEH image.
1>d3dx8.lib(cstack.obj) : error LNK2026: module unsafe for SAFESEH image.
1>d3dx8.lib(shapes.obj) : error LNK2026: module unsafe for SAFESEH image.
1>d3dx8.lib(d3dx8tex.obj) : error LNK2026: module unsafe for SAFESEH image.
1>d3dx8.lib(createmesh.obj) : error LNK2026: module unsafe for SAFESEH image.
1>d3dx8.lib(cpudetect.obj) : error LNK2026: module unsafe for SAFESEH image.
1>d3dx8.lib(d3dx8dbg.obj) : error LNK2026: module unsafe for SAFESEH image.
1>d3dx8.lib(cd3dximage.obj) : error LNK2026: module unsafe for SAFESEH image.
1>d3dx8.lib(cd3dxblt.obj) : error LNK2026: module unsafe for SAFESEH image.
1>d3dx8.lib(cd3dxlock.obj) : error LNK2026: module unsafe for SAFESEH image.
1>d3dx8.lib(cd3dxcodec.obj) : error LNK2026: module unsafe for SAFESEH image.
1>d3dx8.lib(cd3dxfile.obj) : error LNK2026: module unsafe for SAFESEH image.
1>d3dx8.lib(cd3dxresource.obj) : error LNK2026: module unsafe for SAFESEH image.
1>d3dx8.lib(cd3dxbuffer.obj) : error LNK2026: module unsafe for SAFESEH image.
1>d3dx8.lib(loadx.obj) : error LNK2026: module unsafe for SAFESEH image.
1>d3dx8.lib(cleanmesh.obj) : error LNK2026: module unsafe for SAFESEH image.
1>d3dx8.lib(ssefasttable.obj) : error LNK2026: module unsafe for SAFESEH image.
1>d3dx8.lib(ssefasttable2.obj) : error LNK2026: module unsafe for SAFESEH image.
1>d3dx8.lib(d3dxmathx3d.obj) : error LNK2026: module unsafe for SAFESEH image.
1>d3dx8.lib(d3dxmathx86.obj) : error LNK2026: module unsafe for SAFESEH image.
1>d3dx8.lib(jdapimin.obj) : error LNK2026: module unsafe for SAFESEH image.
1>d3dx8.lib(jdapistd.obj) : error LNK2026: module unsafe for SAFESEH image.
1>d3dx8.lib(jdmarker.obj) : error LNK2026: module unsafe for SAFESEH image.
1>d3dx8.lib(jerror.obj) : error LNK2026: module unsafe for SAFESEH image.
1>d3dx8.lib(pngerror.obj) : error LNK2026: module unsafe for SAFESEH image.
1>d3dx8.lib(pngread.obj) : error LNK2026: module unsafe for SAFESEH image.
1>d3dx8.lib(pngget.obj) : error LNK2026: module unsafe for SAFESEH image.
1>d3dx8.lib(pngtrans.obj) : error LNK2026: module unsafe for SAFESEH image.
1>d3dx8.lib(pngrtran.obj) : error LNK2026: module unsafe for SAFESEH image.
1>d3dx8.lib(pngset.obj) : error LNK2026: module unsafe for SAFESEH image.
1>d3dx8.lib(pngrio.obj) : error LNK2026: module unsafe for SAFESEH image.
1>d3dx8.lib(png.obj) : error LNK2026: module unsafe for SAFESEH image.
1>d3dx8.lib(dxtn.obj) : error LNK2026: module unsafe for SAFESEH image.
1>d3dx8.lib(loadutil.obj) : error LNK2026: module unsafe for SAFESEH image.
1>d3dx8.lib(cd3dxstack.obj) : error LNK2026: module unsafe for SAFESEH image.
1>d3dx8.lib(d3dxmathsse.obj) : error LNK2026: module unsafe for SAFESEH image.
1>d3dx8.lib(d3dxquatsse.obj) : error LNK2026: module unsafe for SAFESEH image.
1>d3dx8.lib(d3dxmathsse2.obj) : error LNK2026: module unsafe for SAFESEH image.
1>d3dx8.lib(d3dxquatsse2.obj) : error LNK2026: module unsafe for SAFESEH image.
1>d3dx8.lib(x3d_quat.obj) : error LNK2026: module unsafe for SAFESEH image.
1>d3dx8.lib(x3d_matx.obj) : error LNK2026: module unsafe for SAFESEH image.
1>d3dx8.lib(x3d_vec3.obj) : error LNK2026: module unsafe for SAFESEH image.
1>d3dx8.lib(x3d_vec2.obj) : error LNK2026: module unsafe for SAFESEH image.
1>d3dx8.lib(x3d_vec4.obj) : error LNK2026: module unsafe for SAFESEH image.
1>d3dx8.lib(x3d_plane.obj) : error LNK2026: module unsafe for SAFESEH image.
1>d3dx8.lib(jutils.obj) : error LNK2026: module unsafe for SAFESEH image.
1>d3dx8.lib(jdinput.obj) : error LNK2026: module unsafe for SAFESEH image.
1>d3dx8.lib(jmemmgr.obj) : error LNK2026: module unsafe for SAFESEH image.
1>d3dx8.lib(jcomapi.obj) : error LNK2026: module unsafe for SAFESEH image.
1>d3dx8.lib(jdmaster.obj) : error LNK2026: module unsafe for SAFESEH image.
1>d3dx8.lib(inflate.obj) : error LNK2026: module unsafe for SAFESEH image.
1>d3dx8.lib(pngmem.obj) : error LNK2026: module unsafe for SAFESEH image.
1>d3dx8.lib(pngrutil.obj) : error LNK2026: module unsafe for SAFESEH image.
1>d3dx8.lib(crc32.obj) : error LNK2026: module unsafe for SAFESEH image.
1>d3dx8.lib(d3dxtrigsse.obj) : error LNK2026: module unsafe for SAFESEH image.
1>d3dx8.lib(d3dxtrigsse2.obj) : error LNK2026: module unsafe for SAFESEH image.
1>d3dx8.lib(math.obj) : error LNK2026: module unsafe for SAFESEH image.
1>d3dx8.lib(jmemnobs.obj) : error LNK2026: module unsafe for SAFESEH image.
1>d3dx8.lib(jdmainct.obj) : error LNK2026: module unsafe for SAFESEH image.
1>d3dx8.lib(jdcoefct.obj) : error LNK2026: module unsafe for SAFESEH image.
1>d3dx8.lib(jdhuff.obj) : error LNK2026: module unsafe for SAFESEH image.
1>d3dx8.lib(jdphuff.obj) : error LNK2026: module unsafe for SAFESEH image.
1>d3dx8.lib(jddctmgr.obj) : error LNK2026: module unsafe for SAFESEH image.
1>d3dx8.lib(jdpostct.obj) : error LNK2026: module unsafe for SAFESEH image.
1>d3dx8.lib(jdsample.obj) : error LNK2026: module unsafe for SAFESEH image.
1>d3dx8.lib(jdcolor.obj) : error LNK2026: module unsafe for SAFESEH image.
1>d3dx8.lib(jdmerge.obj) : error LNK2026: module unsafe for SAFESEH image.
1>d3dx8.lib(jquant2.obj) : error LNK2026: module unsafe for SAFESEH image.
1>d3dx8.lib(jquant1.obj) : error LNK2026: module unsafe for SAFESEH image.
1>d3dx8.lib(infblock.obj) : error LNK2026: module unsafe for SAFESEH image.
1>d3dx8.lib(adler32.obj) : error LNK2026: module unsafe for SAFESEH image.
1>d3dx8.lib(zutil.obj) : error LNK2026: module unsafe for SAFESEH image.
1>d3dx8.lib(jidctred.obj) : error LNK2026: module unsafe for SAFESEH image.
1>d3dx8.lib(jidctint.obj) : error LNK2026: module unsafe for SAFESEH image.
1>d3dx8.lib(jidctfst.obj) : error LNK2026: module unsafe for SAFESEH image.
1>d3dx8.lib(jidctflt.obj) : error LNK2026: module unsafe for SAFESEH image.
1>d3dx8.lib(infcodes.obj) : error LNK2026: module unsafe for SAFESEH image.
1>d3dx8.lib(inftrees.obj) : error LNK2026: module unsafe for SAFESEH image.
1>d3dx8.lib(infutil.obj) : error LNK2026: module unsafe for SAFESEH image.
1>d3dx8.lib(piint.obj) : error LNK2026: module unsafe for SAFESEH image.
1>d3dx8.lib(miint.obj) : error LNK2026: module unsafe for SAFESEH image.
1>d3dx8.lib(pifst.obj) : error LNK2026: module unsafe for SAFESEH image.
1>d3dx8.lib(mifst.obj) : error LNK2026: module unsafe for SAFESEH image.
1>d3dx8.lib(inffast.obj) : error LNK2026: module unsafe for SAFESEH image.
1>granny2.lib(granny2.dll) : error LNK2026: module unsafe for SAFESEH image.
1>granny2.lib(granny2.dll) : error LNK2026: module unsafe for SAFESEH image.
1>granny2.lib(granny2.dll) : error LNK2026: module unsafe for SAFESEH image.
1>granny2.lib(granny2.dll) : error LNK2026: module unsafe for SAFESEH image.
1>granny2.lib(granny2.dll) : error LNK2026: module unsafe for SAFESEH image.
1>granny2.lib(granny2.dll) : error LNK2026: module unsafe for SAFESEH image.
1>granny2.lib(granny2.dll) : error LNK2026: module unsafe for SAFESEH image.
1>granny2.lib(granny2.dll) : error LNK2026: module unsafe for SAFESEH image.
1>granny2.lib(granny2.dll) : error LNK2026: module unsafe for SAFESEH image.
1>granny2.lib(granny2.dll) : error LNK2026: module unsafe for SAFESEH image.
1>granny2.lib(granny2.dll) : error LNK2026: module unsafe for SAFESEH image.
1>granny2.lib(granny2.dll) : error LNK2026: module unsafe for SAFESEH image.
1>granny2.lib(granny2.dll) : error LNK2026: module unsafe for SAFESEH image.
1>granny2.lib(granny2.dll) : error LNK2026: module unsafe for SAFESEH image.
1>granny2.lib(granny2.dll) : error LNK2026: module unsafe for SAFESEH image.
1>granny2.lib(granny2.dll) : error LNK2026: module unsafe for SAFESEH image.
1>granny2.lib(granny2.dll) : error LNK2026: module unsafe for SAFESEH image.
1>granny2.lib(granny2.dll) : error LNK2026: module unsafe for SAFESEH image.
1>granny2.lib(granny2.dll) : error LNK2026: module unsafe for SAFESEH image.
1>granny2.lib(granny2.dll) : error LNK2026: module unsafe for SAFESEH image.
1>granny2.lib(granny2.dll) : error LNK2026: module unsafe for SAFESEH image.
1>granny2.lib(granny2.dll) : error LNK2026: module unsafe for SAFESEH image.
1>granny2.lib(granny2.dll) : error LNK2026: module unsafe for SAFESEH image.
1>granny2.lib(granny2.dll) : error LNK2026: module unsafe for SAFESEH image.
1>granny2.lib(granny2.dll) : error LNK2026: module unsafe for SAFESEH image.
1>granny2.lib(granny2.dll) : error LNK2026: module unsafe for SAFESEH image.
1>granny2.lib(granny2.dll) : error LNK2026: module unsafe for SAFESEH image.
1>granny2.lib(granny2.dll) : error LNK2026: module unsafe for SAFESEH image.
1>granny2.lib(granny2.dll) : error LNK2026: module unsafe for SAFESEH image.
1>granny2.lib(granny2.dll) : error LNK2026: module unsafe for SAFESEH image.
1>granny2.lib(granny2.dll) : error LNK2026: module unsafe for SAFESEH image.
1>granny2.lib(granny2.dll) : error LNK2026: module unsafe for SAFESEH image.
1>granny2.lib(granny2.dll) : error LNK2026: module unsafe for SAFESEH image.
1>granny2.lib(granny2.dll) : error LNK2026: module unsafe for SAFESEH image.
1>granny2.lib(granny2.dll) : error LNK2026: module unsafe for SAFESEH image.
1>granny2.lib(granny2.dll) : error LNK2026: module unsafe for SAFESEH image.
1>granny2.lib(granny2.dll) : error LNK2026: module unsafe for SAFESEH image.
1>granny2.lib(granny2.dll) : error LNK2026: module unsafe for SAFESEH image.
1>granny2.lib(granny2.dll) : error LNK2026: module unsafe for SAFESEH image.
1>granny2.lib(granny2.dll) : error LNK2026: module unsafe for SAFESEH image.
1>granny2.lib(granny2.dll) : error LNK2026: module unsafe for SAFESEH image.
1>granny2.lib(granny2.dll) : error LNK2026: module unsafe for SAFESEH image.
1>granny2.lib(granny2.dll) : error LNK2026: module unsafe for SAFESEH image.
1>granny2.lib(granny2.dll) : error LNK2026: module unsafe for SAFESEH image.
1>granny2.lib(granny2.dll) : error LNK2026: module unsafe for SAFESEH image.
1>granny2.lib(granny2.dll) : error LNK2026: module unsafe for SAFESEH image.
1>granny2.lib(granny2.dll) : error LNK2026: module unsafe for SAFESEH image.
1>granny2.lib(granny2.dll) : error LNK2026: module unsafe for SAFESEH image.
1>granny2.lib(granny2.dll) : error LNK2026: module unsafe for SAFESEH image.
1>granny2.lib(granny2.dll) : error LNK2026: module unsafe for SAFESEH image.
1>granny2.lib(granny2.dll) : error LNK2026: module unsafe for SAFESEH image.
1>granny2.lib(granny2.dll) : error LNK2026: module unsafe for SAFESEH image.
1>granny2.lib(granny2.dll) : error LNK2026: module unsafe for SAFESEH image.
1>granny2.lib(granny2.dll) : error LNK2026: module unsafe for SAFESEH image.
1>granny2.lib(granny2.dll) : error LNK2026: module unsafe for SAFESEH image.
1>granny2.lib(granny2.dll) : error LNK2026: module unsafe for SAFESEH image.
1>mss32.lib(mss32.dll) : error LNK2026: module unsafe for SAFESEH image.
1>mss32.lib(mss32.dll) : error LNK2026: module unsafe for SAFESEH image.
1>mss32.lib(mss32.dll) : error LNK2026: module unsafe for SAFESEH image.
1>mss32.lib(mss32.dll) : error LNK2026: module unsafe for SAFESEH image.
1>mss32.lib(mss32.dll) : error LNK2026: module unsafe for SAFESEH image.
1>mss32.lib(mss32.dll) : error LNK2026: module unsafe for SAFESEH image.
1>mss32.lib(mss32.dll) : error LNK2026: module unsafe for SAFESEH image.
1>mss32.lib(mss32.dll) : error LNK2026: module unsafe for SAFESEH image.
1>mss32.lib(mss32.dll) : error LNK2026: module unsafe for SAFESEH image.
1>mss32.lib(mss32.dll) : error LNK2026: module unsafe for SAFESEH image.
1>mss32.lib(mss32.dll) : error LNK2026: module unsafe for SAFESEH image.
1>mss32.lib(mss32.dll) : error LNK2026: module unsafe for SAFESEH image.
1>mss32.lib(mss32.dll) : error LNK2026: module unsafe for SAFESEH image.
1>mss32.lib(mss32.dll) : error LNK2026: module unsafe for SAFESEH image.
1>mss32.lib(mss32.dll) : error LNK2026: module unsafe for SAFESEH image.
1>mss32.lib(mss32.dll) : error LNK2026: module unsafe for SAFESEH image.
1>mss32.lib(mss32.dll) : error LNK2026: module unsafe for SAFESEH image.
1>mss32.lib(mss32.dll) : error LNK2026: module unsafe for SAFESEH image.
1>mss32.lib(mss32.dll) : error LNK2026: module unsafe for SAFESEH image.
1>mss32.lib(mss32.dll) : error LNK2026: module unsafe for SAFESEH image.
1>mss32.lib(cleanup.obj) : error LNK2026: module unsafe for SAFESEH image.
1>mss32.lib(mss32.dll) : error LNK2026: module unsafe for SAFESEH image.
1>mss32.lib(mss32.dll) : error LNK2026: module unsafe for SAFESEH image.
1>mss32.lib(mss32.dll) : error LNK2026: module unsafe for SAFESEH image.
1>mss32.lib(mss32.dll) : error LNK2026: module unsafe for SAFESEH image.
1>mss32.lib(mss32.dll) : error LNK2026: module unsafe for SAFESEH image.
1>mss32.lib(mss32.dll) : error LNK2026: module unsafe for SAFESEH image.
1>mss32.lib(mss32.dll) : error LNK2026: module unsafe for SAFESEH image.
1>mss32.lib(mss32.dll) : error LNK2026: module unsafe for SAFESEH image.
1>mss32.lib(mss32.dll) : error LNK2026: module unsafe for SAFESEH image.
1>mss32.lib(mss32.dll) : error LNK2026: module unsafe for SAFESEH image.
1>mss32.lib(mss32.dll) : error LNK2026: module unsafe for SAFESEH image.
1>mss32.lib(mss32.dll) : error LNK2026: module unsafe for SAFESEH image.
1>mss32.lib(mss32.dll) : error LNK2026: module unsafe for SAFESEH image.
1>mss32.lib(mss32.dll) : error LNK2026: module unsafe for SAFESEH image.
1>mss32.lib(mss32.dll) : error LNK2026: module unsafe for SAFESEH image.
1>mss32.lib(mss32.dll) : error LNK2026: module unsafe for SAFESEH image.
1>mss32.lib(mss32.dll) : error LNK2026: module unsafe for SAFESEH image.
1>mss32.lib(mss32.dll) : error LNK2026: module unsafe for SAFESEH image.
1>mss32.lib(mss32.dll) : error LNK2026: module unsafe for SAFESEH image.
1>mss32.lib(mss32.dll) : error LNK2026: module unsafe for SAFESEH image.
1>mss32.lib(mss32.dll) : error LNK2026: module unsafe for SAFESEH image.
1>mss32.lib(mss32.dll) : error LNK2026: module unsafe for SAFESEH image.
1>mss32.lib(mss32.dll) : error LNK2026: module unsafe for SAFESEH image.
1>mss32.lib(mss32.dll) : error LNK2026: module unsafe for SAFESEH image.
1>mss32.lib(mss32.dll) : error LNK2026: module unsafe for SAFESEH image.
1>mss32.lib(mss32.dll) : error LNK2026: module unsafe for SAFESEH image.
1>mss32.lib(mss32.dll) : error LNK2026: module unsafe for SAFESEH image.
1>mss32.lib(mss32.dll) : error LNK2026: module unsafe for SAFESEH image.
1>mss32.lib(mss32.dll) : error LNK2026: module unsafe for SAFESEH image.
1>mss32.lib(mss32.dll) : error LNK2026: module unsafe for SAFESEH image.
1>mss32.lib(mss32.dll) : error LNK2026: module unsafe for SAFESEH image.
1>mss32.lib(mss32.dll) : error LNK2026: module unsafe for SAFESEH image.
1>mss32.lib(mss32.dll) : error LNK2026: module unsafe for SAFESEH image.
1>mss32.lib(mss32.dll) : error LNK2026: module unsafe for SAFESEH image.
1>dinput8.lib(dilib2.obj) : error LNK2026: module unsafe for SAFESEH image.
1>  cryptlib-5.6.1MT.lib(cryptlib.obj) : MSIL .netmodule or module compiled with /GL found; restarting link with /LTCG; add /LTCG to the link command line to improve linker performance
1>LINK : warning LNK4075: ignoring '/INCREMENTAL' due to '/LTCG' specification
1>cryptlib-5.6.1MT.lib(cryptlib.obj) : error LNK2001: unresolved external symbol "public: static void __cdecl std::_String_base::_Xlen(void)" ([email protected][email protected]@@SAXXZ)
1>cryptlib-5.6.1MT.lib(cryptlib.obj) : error LNK2001: unresolved external symbol "public: static void __cdecl std::_String_base::_Xran(void)" ([email protected][email protected]@@SAXXZ)
1>cryptlib-5.6.1MT.lib(gf2n.obj) : error LNK2001: unresolved external symbol "public: void __thiscall std::_Mutex::_Unlock(void)" ([email protected][email protected]@@QAEXXZ)
1>cryptlib-5.6.1MT.lib(gf2n.obj) : error LNK2001: unresolved external symbol "public: void __thiscall std::_Mutex::_Lock(void)" ([email protected][email protected]@@QAEXXZ)
1>cryptlib-5.6.1MT.lib(integer.obj) : error LNK2001: unresolved external symbol "private: static void __cdecl std::locale::facet::facet_Register(class std::locale::facet *)" ([email protected]@[email protected]@@[email protected]@Z)
1>cryptlib-5.6.1MT.lib(integer.obj) : error LNK2001: unresolved external symbol "public: static void __cdecl std::_Locinfo::_Locinfo_ctor(class std::_Locinfo *,class std::basic_string<char,struct std::char_traits<char>,class std::allocator<char> > const &)" ([email protected][email protected]@@[email protected][email protected][email protected]@[email protected]@[email protected]@[email protected]@[email protected]@Z)
1>Distribute/metin2client.exe : fatal error LNK1120: 6 unresolved externals
========== Build: 0 succeeded, 1 failed, 0 up-to-date, 0 skipped ==========

 

 

Other build log:

 ========== Build: 0 succeeded, 0 failed, 15 up-to-date, 0 skipped ==========

 

 

Sorry for English

Link to comment
Share on other sites

  • Answers 1
  • Created
  • Last Reply

Top Posters For This Question

Popular Days

1 answer to this question

Recommended Posts

Create an account or sign in to comment

You need to be a member in order to leave a comment

Create an account

Sign up for a new account in our community. It's easy!

Register a new account

Sign in

Already have an account? Sign in here.

Sign In Now


Important Information

Terms of Use / Privacy Policy / Guidelines / We have placed cookies on your device to help make this website better. You can adjust your cookie settings, otherwise we'll assume you're okay to continue.