Jump to content
Forgot your email address? ×
×
×
  • Create New...
  • 0

Compilation problem


WhiteZetsu

Question

hi!
i got this errors


/usr/local/lib/gcc48/include/c++/cstdlib:178:10: error: expected unqualified-id before '__int128'
   inline __int128
          ^
In file included from debug_allocator.h:4:0,
                 from stdafx.h:7,
                 from MarkConvert.cpp:1:
/usr/local/lib/gcc48/include/c++/cstdlib:178:10: error: expected unqualified-id before '__int128'
   inline __int128
          ^
In file included from debug_allocator.h:4:0,
                 from stdafx.h:7,
                 from blend_item.cpp:10:
/usr/local/lib/gcc48/include/c++/cstdlib:178:10: error: expected unqualified-id before '__int128'
   inline __int128
          ^
In file included from debug_allocator.h:4:0,
                 from stdafx.h:7,
                 from TrafficProfiler.cpp:10:
/usr/local/lib/gcc48/include/c++/cstdlib:178:10: error: expected unqualified-id before '__int128'
   inline __int128
          ^
In file included from debug_allocator.h:4:0,
                 from stdafx.h:7,
                 from MarkManager.cpp:1:
/usr/local/lib/gcc48/include/c++/cstdlib:178:10: error: expected unqualified-id before '__int128'
   inline __int128
          ^
In file included from debug_allocator.h:4:0,
                 from stdafx.h:7,
                 from MarkImage.cpp:1:
/usr/local/lib/gcc48/include/c++/cstdlib:178:10: error: expected unqualified-id before '__int128'
   inline __int128
          ^
In file included from debug_allocator.h:4:0,
                 from stdafx.h:7,
                 from block_country.cpp:10:
/usr/local/lib/gcc48/include/c++/cstdlib:178:10: error: expected unqualified-id before '__int128'
   inline __int128
          ^
gmake: *** [OBJDIR/MarkConvert.o] Error 1
gmake: *** [OBJDIR/MarkImage.o] Error 1
gmake: *** [OBJDIR/block_country.o] Error 1
gmake: *** [OBJDIR/TrafficProfiler.o] Error 1
In file included from debug_allocator.h:4:0,
                 from stdafx.h:7,
                 from BattleArena.cpp:1:
/usr/local/lib/gcc48/include/c++/cstdlib:178:10: error: expected unqualified-id before '__int128'
   inline __int128
          ^
In file included from debug_allocator.h:4:0,
                 from stdafx.h:7,
                 from battle.cpp:1:
/usr/local/lib/gcc48/include/c++/cstdlib:178:10: error: expected unqualified-id before '__int128'
   inline __int128
          ^
gmake: *** [OBJDIR/buffer_manager.o] Error 1
In file included from debug_allocator.h:4:0,
                 from stdafx.h:7,
                 from char_change_empire.cpp:2:
/usr/local/lib/gcc48/include/c++/cstdlib:178:10: error: expected unqualified-id before '__int128'
   inline __int128
          ^
In file included from debug_allocator.h:4:0,
                 from stdafx.h:7,
                 from ani.cpp:10:
/usr/local/lib/gcc48/include/c++/cstdlib:178:10: error: expected unqualified-id before '__int128'
   inline __int128
          ^
gmake: *** [OBJDIR/MarkManager.o] Error 1
In file included from debug_allocator.h:4:0,
                 from stdafx.h:7,
                 from char_affect.cpp:2:
/usr/local/lib/gcc48/include/c++/cstdlib:178:10: error: expected unqualified-id before '__int128'
   inline __int128
          ^
In file included from debug_allocator.h:4:0,
                 from stdafx.h:7,
                 from building.cpp:1:
/usr/local/lib/gcc48/include/c++/cstdlib:178:10: error: expected unqualified-id before '__int128'
   inline __int128
          ^
In file included from debug_allocator.h:4:0,
                 from stdafx.h:7,
                 from banword.cpp:1:
/usr/local/lib/gcc48/include/c++/cstdlib:178:10: error: expected unqualified-id before '__int128'
   inline __int128
          ^
gmake: *** [OBJDIR/blend_item.o] Error 1
char.cpp:7234:3: warning: this decimal constant is unsigned only in ISO C90 [enabled by default]
   return 2500000000;
   ^
In file included from debug_allocator.h:4:0,
                 from stdafx.h:7,
                 from castle.cpp:12:
/usr/local/lib/gcc48/include/c++/cstdlib:178:10: error: expected unqualified-id before '__int128'
   inline __int128
          ^
In file included from debug_allocator.h:4:0,
                 from stdafx.h:7,
                 from arena.cpp:1:
/usr/local/lib/gcc48/include/c++/cstdlib:178:10: error: expected unqualified-id before '__int128'
   inline __int128
          ^
In file included from debug_allocator.h:4:0,
                 from stdafx.h:7,
                 from char_battle.cpp:1:
/usr/local/lib/gcc48/include/c++/cstdlib:178:10: error: expected unqualified-id before '__int128'
   inline __int128
          ^
In file included from debug_allocator.h:4:0,
                 from stdafx.h:7,
                 from char.cpp:1:
/usr/local/lib/gcc48/include/c++/cstdlib:178:10: error: expected unqualified-id before '__int128'
   inline __int128
          ^
In file included from debug_allocator.h:4:0,
                 from stdafx.h:7,
                 from OXEvent.cpp:1:
/usr/local/lib/gcc48/include/c++/cstdlib:178:10: error: expected unqualified-id before '__int128'
   inline __int128
          ^
In file included from ../../../Extern/include/boost/limits.hpp:19:0,
                 from ../../../Extern/include/boost/functional/hash/detail/limits.hpp:16,
                 from ../../../Extern/include/boost/functional/hash/detail/hash_float.hpp:15,
                 from ../../../Extern/include/boost/functional/hash/hash.hpp:15,
                 from ../../../Extern/include/boost/functional/hash.hpp:6,
                 from ../../../Extern/include/boost/unordered/unordered_map.hpp:17,
                 from ../../../Extern/include/boost/unordered_map.hpp:16,
                 from char.h:4,
                 from char_change_empire.cpp:4:
/usr/local/lib/gcc48/include/c++/limits:1405:35: error: template argument 1 is invalid
     struct numeric_limits<__int128>
                                   ^
/usr/local/lib/gcc48/include/c++/limits:1479:44: error: template argument 1 is invalid
     struct numeric_limits<unsigned __int128>
                                            ^
In file included from ../../../Extern/include/boost/limits.hpp:19:0,
                 from ../../../Extern/include/boost/functional/hash/detail/limits.hpp:16,
                 from ../../../Extern/include/boost/functional/hash/detail/hash_float.hpp:15,
                 from ../../../Extern/include/boost/functional/hash/hash.hpp:15,
                 from ../../../Extern/include/boost/functional/hash.hpp:6,
                 from ../../../Extern/include/boost/unordered/unordered_map.hpp:17,
                 from ../../../Extern/include/boost/unordered_map.hpp:16,
                 from char.h:4,
                 from BattleArena.cpp:6:
/usr/local/lib/gcc48/include/c++/limits:1405:35: error: template argument 1 is invalid
     struct numeric_limits<__int128>
                                   ^
/usr/local/lib/gcc48/include/c++/limits:1479:44: error: template argument 1 is invalid
     struct numeric_limits<unsigned __int128>
                                            ^
In file included from ../../../Extern/include/boost/limits.hpp:19:0,
                 from ../../../Extern/include/boost/functional/hash/detail/limits.hpp:16,
                 from ../../../Extern/include/boost/functional/hash/detail/hash_float.hpp:15,
                 from ../../../Extern/include/boost/functional/hash/hash.hpp:15,
                 from ../../../Extern/include/boost/functional/hash.hpp:6,
                 from ../../../Extern/include/boost/unordered/unordered_map.hpp:17,
                 from ../../../Extern/include/boost/unordered_map.hpp:16,
                 from char.h:4,
                 from char_affect.cpp:5:
/usr/local/lib/gcc48/include/c++/limits:1405:35: error: template argument 1 is invalid
     struct numeric_limits<__int128>
                                   ^
/usr/local/lib/gcc48/include/c++/limits:1479:44: error: template argument 1 is invalid
     struct numeric_limits<unsigned __int128>
                                            ^
In file included from ../../../Extern/include/boost/limits.hpp:19:0,
                 from ../../../Extern/include/boost/functional/hash/detail/limits.hpp:16,
                 from ../../../Extern/include/boost/functional/hash/detail/hash_float.hpp:15,
                 from ../../../Extern/include/boost/functional/hash/hash.hpp:15,
                 from ../../../Extern/include/boost/functional/hash.hpp:6,
                 from ../../../Extern/include/boost/unordered/unordered_map.hpp:17,
                 from ../../../Extern/include/boost/unordered_map.hpp:16,
                 from char.h:4,
                 from battle.cpp:5:
/usr/local/lib/gcc48/include/c++/limits:1405:35: error: template argument 1 is invalid
     struct numeric_limits<__int128>
                                   ^
/usr/local/lib/gcc48/include/c++/limits:1479:44: error: template argument 1 is invalid
     struct numeric_limits<unsigned __int128>
                                            ^
In file included from ../../../Extern/include/boost/limits.hpp:19:0,
                 from ../../../Extern/include/boost/functional/hash/detail/limits.hpp:16,
                 from ../../../Extern/include/boost/functional/hash/detail/hash_float.hpp:15,
                 from ../../../Extern/include/boost/functional/hash/hash.hpp:15,
                 from ../../../Extern/include/boost/functional/hash.hpp:6,
                 from ../../../Extern/include/boost/unordered/unordered_map.hpp:17,
                 from ../../../Extern/include/boost/unordered_map.hpp:16,
                 from char.h:4,
                 from ani.cpp:11:
/usr/local/lib/gcc48/include/c++/limits:1405:35: error: template argument 1 is invalid
     struct numeric_limits<__int128>
                                   ^
/usr/local/lib/gcc48/include/c++/limits:1479:44: error: template argument 1 is invalid
     struct numeric_limits<unsigned __int128>
                                            ^
In file included from ../../../Extern/include/boost/limits.hpp:19:0,
                 from ../../../Extern/include/boost/functional/hash/detail/limits.hpp:16,
                 from ../../../Extern/include/boost/functional/hash/detail/hash_float.hpp:15,
                 from ../../../Extern/include/boost/functional/hash/hash.hpp:15,
                 from ../../../Extern/include/boost/functional/hash.hpp:6,
                 from ../../../Extern/include/boost/unordered/unordered_map.hpp:17,
                 from ../../../Extern/include/boost/unordered_map.hpp:16,
                 from banword.h:5,
                 from banword.cpp:3:
/usr/local/lib/gcc48/include/c++/limits:1405:35: error: template argument 1 is invalid
     struct numeric_limits<__int128>
                                   ^
/usr/local/lib/gcc48/include/c++/limits:1479:44: error: template argument 1 is invalid
     struct numeric_limits<unsigned __int128>
                                            ^
In file included from ../../../Extern/include/boost/limits.hpp:19:0,
                 from ../../../Extern/include/boost/functional/hash/detail/limits.hpp:16,
                 from ../../../Extern/include/boost/functional/hash/detail/hash_float.hpp:15,
                 from ../../../Extern/include/boost/functional/hash/hash.hpp:15,
                 from ../../../Extern/include/boost/functional/hash.hpp:6,
                 from ../../../Extern/include/boost/unordered/unordered_map.hpp:17,
                 from ../../../Extern/include/boost/unordered_map.hpp:16,
                 from char.h:4,
                 from char.cpp:6:
/usr/local/lib/gcc48/include/c++/limits:1405:35: error: template argument 1 is invalid
     struct numeric_limits<__int128>
                                   ^
/usr/local/lib/gcc48/include/c++/limits:1479:44: error: template argument 1 is invalid
     struct numeric_limits<unsigned __int128>
                                            ^
In file included from ../../../Extern/include/boost/limits.hpp:19:0,
                 from ../../../Extern/include/boost/functional/hash/detail/limits.hpp:16,
                 from ../../../Extern/include/boost/functional/hash/detail/hash_float.hpp:15,
                 from ../../../Extern/include/boost/functional/hash/hash.hpp:15,
                 from ../../../Extern/include/boost/functional/hash.hpp:6,
                 from ../../../Extern/include/boost/unordered/unordered_map.hpp:17,
                 from ../../../Extern/include/boost/unordered_map.hpp:16,
                 from questmanager.h:4,
                 from arena.cpp:8:
/usr/local/lib/gcc48/include/c++/limits:1405:35: error: template argument 1 is invalid
     struct numeric_limits<__int128>
                                   ^
/usr/local/lib/gcc48/include/c++/limits:1479:44: error: template argument 1 is invalid
     struct numeric_limits<unsigned __int128>
                                            ^
In file included from ../../../Extern/include/boost/limits.hpp:19:0,
                 from ../../../Extern/include/boost/functional/hash/detail/limits.hpp:16,
                 from ../../../Extern/include/boost/functional/hash/detail/hash_float.hpp:15,
                 from ../../../Extern/include/boost/functional/hash/hash.hpp:15,
                 from ../../../Extern/include/boost/functional/hash.hpp:6,
                 from ../../../Extern/include/boost/unordered/unordered_map.hpp:17,
                 from ../../../Extern/include/boost/unordered_map.hpp:16,
                 from questmanager.h:4,
                 from OXEvent.cpp:4:
/usr/local/lib/gcc48/include/c++/limits:1405:35: error: template argument 1 is invalid
     struct numeric_limits<__int128>
                                   ^
/usr/local/lib/gcc48/include/c++/limits:1479:44: error: template argument 1 is invalid
     struct numeric_limits<unsigned __int128>
                                            ^
In file included from ../../../Extern/include/boost/limits.hpp:19:0,
                 from ../../../Extern/include/boost/functional/hash/detail/limits.hpp:16,
                 from ../../../Extern/include/boost/functional/hash/detail/hash_float.hpp:15,
                 from ../../../Extern/include/boost/functional/hash/hash.hpp:15,
                 from ../../../Extern/include/boost/functional/hash.hpp:6,
                 from ../../../Extern/include/boost/unordered/unordered_map.hpp:17,
                 from ../../../Extern/include/boost/unordered_map.hpp:16,
                 from char.h:4,
                 from castle.cpp:21:
/usr/local/lib/gcc48/include/c++/limits:1405:35: error: template argument 1 is invalid
     struct numeric_limits<__int128>
                                   ^
/usr/local/lib/gcc48/include/c++/limits:1479:44: error: template argument 1 is invalid
     struct numeric_limits<unsigned __int128>
                                            ^
In file included from ../../../Extern/include/boost/limits.hpp:19:0,
                 from ../../../Extern/include/boost/functional/hash/detail/limits.hpp:16,
                 from ../../../Extern/include/boost/functional/hash/detail/hash_float.hpp:15,
                 from ../../../Extern/include/boost/functional/hash/hash.hpp:15,
                 from ../../../Extern/include/boost/functional/hash.hpp:6,
                 from ../../../Extern/include/boost/unordered/unordered_map.hpp:17,
                 from ../../../Extern/include/boost/unordered_map.hpp:16,
                 from desc_manager.h:4,
                 from char_battle.cpp:5:
/usr/local/lib/gcc48/include/c++/limits:1405:35: error: template argument 1 is invalid
     struct numeric_limits<__int128>
                                   ^
/usr/local/lib/gcc48/include/c++/limits:1479:44: error: template argument 1 is invalid
     struct numeric_limits<unsigned __int128>
                                            ^
In file included from ../../../Extern/include/boost/limits.hpp:19:0,
                 from ../../../Extern/include/boost/functional/hash/detail/limits.hpp:16,
                 from ../../../Extern/include/boost/functional/hash/detail/hash_float.hpp:15,
                 from ../../../Extern/include/boost/functional/hash/hash.hpp:15,
                 from ../../../Extern/include/boost/functional/hash.hpp:6,
                 from ../../../Extern/include/boost/unordered/unordered_map.hpp:17,
                 from ../../../Extern/include/boost/unordered_map.hpp:16,
                 from char.h:4,
                 from building.cpp:8:
/usr/local/lib/gcc48/include/c++/limits:1405:35: error: template argument 1 is invalid
     struct numeric_limits<__int128>
                                   ^
/usr/local/lib/gcc48/include/c++/limits:1479:44: error: template argument 1 is invalid
     struct numeric_limits<unsigned __int128>
Link to comment
  • Answers 5
  • Created
  • Last Reply

Top Posters For This Question

Top Posters For This Question

5 answers to this question

Recommended Posts

  • 0

up!

and I have this error

In file included from /usr/local/lib/gcc49/include/c++/random:49:0,
                 from /usr/local/lib/gcc49/include/c++/bits/stl_algo.h:66,
                 from /usr/local/lib/gcc49/include/c++/algorithm:62,
                 from stdafx.h:15,
                 from buffer_manager.cpp:1:
/usr/local/lib/gcc49/include/c++/bits/random.h:106:26: error: expected unqualified-id before '__int128'
       { typedef unsigned __int128 type; };
                          ^
In file included from /usr/local/lib/gcc49/include/c++/random:49:0,
                 from /usr/local/lib/gcc49/include/c++/bits/stl_algo.h:66,
                 from /usr/local/lib/gcc49/include/c++/algorithm:62,
                 from stdafx.h:15,
                 from MarkManager.cpp:1:
/usr/local/lib/gcc49/include/c++/bits/random.h:106:26: error: expected unqualified-id before '__int128'
       { typedef unsigned __int128 type; };

i have freebsd 9.3x64

how i can fix this???

Link to comment

Create an account or sign in to comment

You need to be a member in order to leave a comment

Create an account

Sign up for a new account in our community. It's easy!

Register a new account

Sign in

Already have an account? Sign in here.

Sign In Now

Announcements

  • -15% Discount in Metin2 Dev Store (01/10/2021 => 31/12/2021) => Code => 15_PCT_OCT_TO_DEC_2021


  • Read our Rules
  • Activity

    1. 19

      Fix unknown header 100% server: 1k player online francec

    2. 19

      Fix unknown header 100% server: 1k player online francec

    3. 29

      Metin2 Project - How to create à Metin2 private server on virtual machine

    4. 40

      Changelogs

    5. 1

      I'm looking for a partner

    6. 5

      Help in implementing a switch bot

    7. 0

      Error FoxFS source install

    8. 5

      Help in implementing a switch bot

    9. 1

      I'm looking for a partner

  • Recently Browsing

    • No registered users viewing this page.

Important Information

Terms of Use / Privacy Policy / Guidelines / We have placed cookies on your device to help make this website better. You can adjust your cookie settings, otherwise we'll assume you're okay to continue.