Jump to content

Recommended Posts

Hello, first of all congratulations and thank you very much for the contribution to Owsap!

I am having an error when compiling the game source, I am quite new to this,

o any help is greatly appreciated, again thank you very much in advance and greetings!

Error in question;

questmanager.cpp: In member function ´int quest:: CQuestManager::ReadQuestCagoryFile(WORD)´:

questmanager.cpp:227: error: ´struct std:: string´has no member named ´front´

questmanager.cpp:230: error: ´stoi´was not declared in this scope

gmake: *** [OBJDIR/questmanager.o] Error 1

 

Sorry for opening a new topic for this, but in the thread itself I can't see the reply or write message button anywhere,

if I'm in the wrong place I apologize and move me if you think it's necessary, thank you.

Edited by SnakeSlap
  • Replies 0
  • Created
  • Last Reply

Top Posters In This Topic

Popular Days

Top Posters In This Topic

Don't use any images from : imgur, turkmmop, freakgamers, inforge, hizliresim... Or your content will be deleted without notice...
Use : https://metin2.download/media/add/

Please use https://metin2.download/ when uploading files smaller than 100MB, otherwise the approval will take longer due to manual upload.

Please sign in to comment

You will be able to leave a comment after signing in



Sign In Now
×
×
  • Create New...

Important Information

Terms of Use / Privacy Policy / Guidelines / We have placed cookies on your device to help make this website better. You can adjust your cookie settings, otherwise we'll assume you're okay to continue.