Jump to content
×
×
  • Create New...
  • 0

Compile Server


mohanad1111

Question

cmd_general.cpp: In function 'void do_ds_change_attr(CHARACTER*, const char*, int, int)':
cmd_general.cpp:3857: warning: comparison is always true due to limited range of data type
cmd_general.cpp: In function 'void do_add_new_attribute(CHARACTER*, const char*, int, int)':
cmd_general.cpp:4041: error: 'class CItem' has no member named 'AddNewAttr'
cmd_general.cpp:4042: error: 'class CItem' has no member named 'AddNewAttr'
cmd_general.cpp:4043: error: 'class CItem' has no member named 'AddNewAttr'
cmd_general.cpp:4044: error: 'class CItem' has no member named 'AddNewAttr'
cmd_general.cpp:4055: error: 'class CItem' has no member named 'AddNewAttr'
cmd_general.cpp:4056: error: 'class CItem' has no member named 'AddNewAttr'
cmd_general.cpp:4057: error: 'class CItem' has no member named 'AddNewAttr'
compiling constants.cpp
compiling crc32.cpp
gmake: *** [.obj/cmd_general.o] Error 1
gmake: *** Waiting for unfinished jobs....
---

cmd_general.cpp

https://pastebin.com/2aScZeb3

Edited by mohanad1111
Link to comment
Share on other sites

  • Answers 0
  • Created
  • Last Reply

Top Posters For This Question

Popular Days

Top Posters For This Question

Popular Days

0 answers to this question

Recommended Posts

There have been no answers to this question yet

Create an account or sign in to comment

You need to be a member in order to leave a comment

Create an account

Sign up for a new account in our community. It's easy!

Register a new account

Sign in

Already have an account? Sign in here.

Sign In Now


Important Information

Terms of Use / Privacy Policy / Guidelines / We have placed cookies on your device to help make this website better. You can adjust your cookie settings, otherwise we'll assume you're okay to continue.