cmd_general.cpp: In function 'void do_ds_change_attr(CHARACTER*, const char*, int, int)':
cmd_general.cpp:3857: warning: comparison is always true due to limited range of data type
cmd_general.cpp: In function 'void do_add_new_attribute(CHARACTER*, const char*, int, int)':
cmd_general.cpp:4041: error: 'class CItem' has no member named 'AddNewAttr'
cmd_general.cpp:4042: error: 'class CItem' has no member named 'AddNewAttr'
cmd_general.cpp:4043: error: 'class CItem' has no member named 'AddNewAttr'
cmd_general.cpp:4044: error: 'class CItem' has no member named 'AddNewAttr'
cmd_general.cpp:4055: error: 'class CItem' has no member named 'AddNewAttr'
cmd_general.cpp:4056: error: 'class CItem' has no member named 'AddNewAttr'
cmd_general.cpp:4057: error: 'class CItem' has no member named 'AddNewAttr'
compiling constants.cpp
compiling crc32.cpp
gmake: *** [.obj/cmd_general.o] Error 1
gmake: *** Waiting for unfinished jobs....
---
cmd_general.cpp
[Hidden Content]