Jump to content

Recommended Posts

Hello!
When I try to compile my mainline_released source, I get this error, and I don't know how to fix it. Can you help me?

 

g++: directory": No such file or directory
<command-line>: warning: missing terminating " character
version.cpp:11: error: missing terminating " character
version.cpp: In function 'void WriteVersion()':
version.cpp:11: error: expected primary-expression before ')' token
gmake: *** [.obj/version.o] Error 1
gmake: *** Waiting for unfinished jobs....

Here are my makefile and version.cpp files: 

This is the hidden content, please

Link to comment
https://metin2.dev/topic/15939-40k-source-error/
Share on other sites

  • Replies 1
  • Created
  • Last Reply

Top Posters In This Topic

Popular Days

Top Posters In This Topic

Don't use any images from : imgur, turkmmop, freakgamers, inforge, hizliresim... Or your content will be deleted without notice...
Use : https://metin2.download/media/add/

Please use https://metin2.download/ when uploading files smaller than 100MB, otherwise the approval will take longer due to manual upload.

Please sign in to comment

You will be able to leave a comment after signing in



Sign In Now
×
×
  • Create New...

Important Information

Terms of Use / Privacy Policy / Guidelines / We have placed cookies on your device to help make this website better. You can adjust your cookie settings, otherwise we'll assume you're okay to continue.