Jump to content

HWAN

Inactive Member
  • Posts

    2
  • Joined

  • Last visited

  • Feedback

    0%

About HWAN

Informations

  • Gender
    Male

Recent Profile Visitors

The recent visitors block is disabled and is not being shown to other users.

HWAN's Achievements

Newbie

Newbie (1/16)

  • First Post
  • Conversation Starter
  • Week One Done
  • One Month Later
  • One Year In

Recent Badges

0

Reputation

  1. Hello! When I try to compile my mainline_released source, I get this error, and I don't know how to fix it. Can you help me? g++: directory": No such file or directory <command-line>: warning: missing terminating " character version.cpp:11: error: missing terminating " character version.cpp: In function 'void WriteVersion()': version.cpp:11: error: expected primary-expression before ')' token gmake: *** [.obj/version.o] Error 1 gmake: *** Waiting for unfinished jobs.... Here are my makefile and version.cpp files: [Hidden Content]
×
×
  • Create New...

Important Information

Terms of Use / Privacy Policy / Guidelines / We have placed cookies on your device to help make this website better. You can adjust your cookie settings, otherwise we'll assume you're okay to continue.