Jump to content

Problem sash system compile


Recommended Posts

Hello! i add sash in db source

when i compile i have this error:

Spoiler

gmake: Warning: File `Cache.cpp' has modification time 59798 s in the future
Cache.cpp:380:7: warning: no newline at end of file
In file included from ClientManagerBoot.cpp:8:
ProtoReader.h:36:7: warning: no newline at end of file
ItemAwardManager.cpp:129:2: warning: no newline at end of file
AuctionManager.cpp:726:7: warning: no newline at end of file
ClientManagerPlayer.cpp: In function 'size_t CreatePlayerSaveQuery(char*, size_t, TPlayerTable*)':
ClientManagerPlayer.cpp:153: error: 'PART_ACCE' was not declared in this scope
ClientManagerPlayer.cpp: In member function 'char* CClientManager::GetCommand(char*)':
ClientManagerPlayer.cpp:365: warning: address of local variable 'command' returned
ClientManagerPlayer.cpp: In function 'bool CreatePlayerTableFromRes(MYSQL_RES*, TPlayerTable*)':
ClientManagerPlayer.cpp:418: error: 'PART_ACCE' was not declared in this scope
ClientManagerPlayer.cpp: In member function 'void CClientManager::__QUERY_PLAYER_CREATE(CPeer*, DWORD, TPlayerCreatePacket*)':
ClientManagerPlayer.cpp:789: warning: format '%d' expects type 'int', but argument 18 has type 'long int'
ClientManagerPlayer.cpp:789: warning: format '%d' expects type 'int', but argument 19 has type 'long int'
ClientManagerPlayer.cpp:789: warning: format '%d' expects type 'int', but argument 18 has type 'long int'
ClientManagerPlayer.cpp:789: warning: format '%d' expects type 'int', but argument 19 has type 'long int'
ClientManagerLogin.cpp: In function 'void CreateAccountPlayerDataFromRes(MYSQL_RES*, TAccountTable*)':
ClientManagerLogin.cpp:291: error: 'struct TSimplePlayer' has no member named 'wAccePart'
ClientManagerLogin.cpp:291: error: 'PART_ACCE' was not declared in this scope
ClientManagerLogin.cpp:327: error: 'struct TSimplePlayer' has no member named 'wAccePart'
ClientManagerLogin.cpp:334: error: 'struct TSimplePlayer' has no member named 'wAccePart'
gmake: *** [.obj/ClientManagerLogin.o] Error 1
gmake: *** Waiting for unfinished jobs....
ClientManager.cpp: In member function 'void CClientManager::ChangeMonarchLord(CPeer*, DWORD, TPacketChangeMonarchLord*)':
ClientManager.cpp:4117: warning: too few arguments for format
ClientManager.cpp:4117: warning: too few arguments for format
ClientManagerBoot.cpp: In member function 'bool CClientManager::InitializeMobTable()':
ClientManagerBoot.cpp:402: warning: statement has no effect
gmake: *** [.obj/ClientManagerPlayer.o] Error 1

 

Link to comment
Share on other sites

  • Replies 0
  • Created
  • Last Reply

Top Posters In This Topic

Popular Days

Top Posters In This Topic

Popular Days

Please sign in to comment

You will be able to leave a comment after signing in



Sign In Now


×
×
  • Create New...

Important Information

Terms of Use / Privacy Policy / Guidelines / We have placed cookies on your device to help make this website better. You can adjust your cookie settings, otherwise we'll assume you're okay to continue.