Jump to content

Recommended Posts

hi,

i have this problem when i build the game with new pet system


In file included from char_item.cpp:5:
New_PetSystem.h:140: error: ISO C++ forbids declaration of 'unordered_map' with no type
New_PetSystem.h:140: error: typedef name may not be a nested-name-specifier
New_PetSystem.h:140: error: expected ';' before '<' token
New_PetSystem.h:185: error: 'TNewPetActorMap' does not name a type
char_item.cpp: In member function 'bool CHARACTER::UseItemEx(CItem*, TItemPos)':
char_item.cpp:1785: warning: suggest parentheses around assignment used as truth value
gmake: *** [.obj/char_item.o] Error 1
 

any idea ?

 

Link to comment
https://metin2.dev/topic/11403-petsytem-build-problem/
Share on other sites

  • Replies 2
  • Created
  • Last Reply

Top Posters In This Topic

Top Posters In This Topic

Don't use any images from : imgur, turkmmop, freakgamers, inforge, hizliresim... Or your content will be deleted without notice...
Use : https://metin2.download/media/add/

Please use https://metin2.download/ when uploading files smaller than 100MB, otherwise the approval will take longer due to manual upload.

Please sign in to comment

You will be able to leave a comment after signing in



Sign In Now
×
×
  • Create New...

Important Information

Terms of Use / Privacy Policy / Guidelines / We have placed cookies on your device to help make this website better. You can adjust your cookie settings, otherwise we'll assume you're okay to continue.