Jump to content
  • 0

[Problem] : battle pass


mohanad1111
Go to solution Solved by Sonitex,

Question

cmd_general.cpp:3931: error: 'class CHARACTER' has no member named 'IsCombOpen'
cmd_general.cpp:3931: error: 'class CHARACTER' has no member named 'IsOpenMailBo                                                                                                             x'
cmd_general.cpp:3931: error: 'class CHARACTER' has no member named 'isSashOpened                                                                                                             '
cmd_general.cpp:3931: error: 'class CHARACTER' has no member named 'isSashOpened                                                                                                             '
cmd_general.cpp:3948: warning: comparison between signed and unsigned integer ex                                                                                                             pressions
cmd_general.cpp: In function 'void final_reward_battlepass(CHARACTER*, const cha                                                                                                             r*, int, int)':
cmd_general.cpp:3972: error: 'class CHARACTER' has no member named 'IsCombOpen'
cmd_general.cpp:3972: error: 'class CHARACTER' has no member named 'IsOpenMailBo                                                                                                             x'
cmd_general.cpp:3972: error: 'class CHARACTER' has no member named 'isSashOpened                                                                                                             '
cmd_general.cpp:3972: error: 'class CHARACTER' has no member named 'isSashOpened                                                                                                             '
cmd_general.cpp:3989: warning: comparison between signed and unsigned integer ex                                                                                                             pressions
gmake[1]: *** [.obj/cmd_general.o] Error 1
cmd_general.cpp

https://pastebin.com/DwEM0DTJ

Link to post

1 answer to this question

Recommended Posts

  • 1
  • VIP
  • Solution

You are missing one of these functions in CHARACTER class:

IsCombOpen()
IsOpenMailBox()
isSashOpened()

 

Check both char.h and char.cpp for these ;) 

  • Love 1
Link to post

Join the conversation

You can post now and register later. If you have an account, sign in now to post with your account.
Note: Your post will require moderator approval before it will be visible.

Guest
Answer this question...

×   Pasted as rich text.   Restore formatting

  Only 75 emoji are allowed.

×   Your link has been automatically embedded.   Display as a link instead

×   Your previous content has been restored.   Clear editor

×   You cannot paste images directly. Upload or insert images from URL.



×
×
  • Create New...

Important Information

Terms of Use / Privacy Policy / Guidelines / We have placed cookies on your device to help make this website better. You can adjust your cookie settings, otherwise we'll assume you're okay to continue.