Jump to content
Forgot your email address? ×
×
×
  • Create New...
  • 0

client python-3.5


bogdanxcry

Question

hi , i try to get python 3.5 on my source

any solve on this erros?

 

1>------ Build started: Project: EterPythonLib, Configuration: Release Win32 ------
2>------ Build started: Project: GameLib, Configuration: Release Win32 ------
3>------ Build started: Project: PRTerrainLib, Configuration: Release Win32 ------
4>------ Build started: Project: ScriptLib, Configuration: Release Win32 ------
4>  StdAfx.cpp
1>  StdAfx.cpp
3>  StdAfx.cpp
2>  AreaTerrain.cpp
1>F:roxetexternincludePython-3.5/symtable.h(74): error C2065: 'mod_ty' : undeclared identifier
3>F:roxetexternincludePython-3.5/symtable.h(74): error C2065: 'mod_ty' : undeclared identifier
3>F:roxetexternincludePython-3.5/symtable.h(74): error C2146: syntax error : missing ')' before identifier 'mod'
3>F:roxetexternincludePython-3.5/symtable.h(74): error C2491: 'PySymtable_Build' : definition of dllimport data not allowed
3>F:roxetexternincludePython-3.5/symtable.h(76): error C2059: syntax error : ')'
3>F:roxetexternincludePython-3.5/symtable.h(78): error C2065: 'mod_ty' : undeclared identifier
3>F:roxetexternincludePython-3.5/symtable.h(78): error C2146: syntax error : missing ')' before identifier 'mod'
3>F:roxetexternincludePython-3.5/symtable.h(78): error C2491: 'PySymtable_BuildObject' : definition of dllimport data not allowed
3>F:roxetexternincludePython-3.5/symtable.h(80): error C2059: syntax error : ')'
1>F:roxetexternincludePython-3.5/symtable.h(74): error C2146: syntax error : missing ')' before identifier 'mod'
1>F:roxetexternincludePython-3.5/symtable.h(74): error C2491: 'PySymtable_Build' : definition of dllimport data not allowed
1>F:roxetexternincludePython-3.5/symtable.h(76): error C2059: syntax error : ')'
1>F:roxetexternincludePython-3.5/symtable.h(78): error C2065: 'mod_ty' : undeclared identifier
1>F:roxetexternincludePython-3.5/symtable.h(78): error C2146: syntax error : missing ')' before identifier 'mod'
1>F:roxetexternincludePython-3.5/symtable.h(78): error C2491: 'PySymtable_BuildObject' : definition of dllimport data not allowed
1>F:roxetexternincludePython-3.5/symtable.h(80): error C2059: syntax error : ')'
4>F:roxetexternincludePython-3.5/symtable.h(74): error C2065: 'mod_ty' : undeclared identifier
4>F:roxetexternincludePython-3.5/symtable.h(74): error C2146: syntax error : missing ')' before identifier 'mod'
4>F:roxetexternincludePython-3.5/symtable.h(74): error C2491: 'PySymtable_Build' : definition of dllimport data not allowed
4>F:roxetexternincludePython-3.5/symtable.h(76): error C2059: syntax error : ')'
4>F:roxetexternincludePython-3.5/symtable.h(78): error C2065: 'mod_ty' : undeclared identifier
4>F:roxetexternincludePython-3.5/symtable.h(78): error C2146: syntax error : missing ')' before identifier 'mod'
4>F:roxetexternincludePython-3.5/symtable.h(78): error C2491: 'PySymtable_BuildObject' : definition of dllimport data not allowed
4>F:roxetexternincludePython-3.5/symtable.h(80): error C2059: syntax error : ')'
3>F:roxetexternincludemss.h(1044): warning C4005: 'AT' : macro redefinition
1>F:roxetexternincludemss.h(1044): warning C4005: 'AT' : macro redefinition
4>F:roxetexternincludemss.h(1044): warning C4005: 'AT' : macro redefinition
3>          F:roxetexternincludePython-3.5/token.h(61) : see previous definition of 'AT'
4>          F:roxetexternincludePython-3.5/token.h(61) : see previous definition of 'AT'
1>          F:roxetexternincludePython-3.5/token.h(61) : see previous definition of 'AT'
2>F:roxetexternincludePython-3.5/token.h(61): warning C4005: 'AT' : macro redefinition
2>          F:roxetexternincludemss.h(1044) : see previous definition of 'AT'
2>F:roxetexternincludePython-3.5/symtable.h(74): error C2065: 'mod_ty' : undeclared identifier
2>F:roxetexternincludePython-3.5/symtable.h(74): error C2146: syntax error : missing ')' before identifier 'mod'
2>F:roxetexternincludePython-3.5/symtable.h(74): error C2491: 'PySymtable_Build' : definition of dllimport data not allowed
2>F:roxetexternincludePython-3.5/symtable.h(76): error C2059: syntax error : ')'
2>F:roxetexternincludePython-3.5/symtable.h(78): error C2065: 'mod_ty' : undeclared identifier
2>F:roxetexternincludePython-3.5/symtable.h(78): error C2146: syntax error : missing ')' before identifier 'mod'
2>F:roxetexternincludePython-3.5/symtable.h(78): error C2491: 'PySymtable_BuildObject' : definition of dllimport data not allowed
2>F:roxetexternincludePython-3.5/symtable.h(80): error C2059: syntax error : ')'
2>....sourceGameLibAreaTerrain.cpp(682): warning C4309: '=' : truncation of constant value
2>....sourceGameLibAreaTerrain.cpp(722): warning C4309: '=' : truncation of constant value
2>  MapOutdoor.cpp
2>F:roxetexternincludePython-3.5/token.h(61): warning C4005: 'AT' : macro redefinition
2>          F:roxetexternincludemss.h(1044) : see previous definition of 'AT'
2>F:roxetexternincludePython-3.5/symtable.h(74): error C2065: 'mod_ty' : undeclared identifier
2>F:roxetexternincludePython-3.5/symtable.h(74): error C2146: syntax error : missing ')' before identifier 'mod'
2>F:roxetexternincludePython-3.5/symtable.h(74): error C2491: 'PySymtable_Build' : definition of dllimport data not allowed
2>F:roxetexternincludePython-3.5/symtable.h(76): error C2059: syntax error : ')'
2>F:roxetexternincludePython-3.5/symtable.h(78): error C2065: 'mod_ty' : undeclared identifier
2>F:roxetexternincludePython-3.5/symtable.h(78): error C2146: syntax error : missing ')' before identifier 'mod'
2>F:roxetexternincludePython-3.5/symtable.h(78): error C2491: 'PySymtable_BuildObject' : definition of dllimport data not allowed
2>F:roxetexternincludePython-3.5/symtable.h(80): error C2059: syntax error : ')'
2>....sourceGameLibMapOutdoor.cpp(1510): warning C4309: '=' : truncation of constant value
2>  MapOutdoorUpdate.cpp
2>F:roxetexternincludePython-3.5/token.h(61): warning C4005: 'AT' : macro redefinition
2>          F:roxetexternincludemss.h(1044) : see previous definition of 'AT'
2>F:roxetexternincludePython-3.5/symtable.h(74): error C2065: 'mod_ty' : undeclared identifier
2>F:roxetexternincludePython-3.5/symtable.h(74): error C2146: syntax error : missing ')' before identifier 'mod'
2>F:roxetexternincludePython-3.5/symtable.h(74): error C2491: 'PySymtable_Build' : definition of dllimport data not allowed
2>F:roxetexternincludePython-3.5/symtable.h(76): error C2059: syntax error : ')'
2>F:roxetexternincludePython-3.5/symtable.h(78): error C2065: 'mod_ty' : undeclared identifier
2>F:roxetexternincludePython-3.5/symtable.h(78): error C2146: syntax error : missing ')' before identifier 'mod'
2>F:roxetexternincludePython-3.5/symtable.h(78): error C2491: 'PySymtable_BuildObject' : definition of dllimport data not allowed
2>F:roxetexternincludePython-3.5/symtable.h(80): error C2059: syntax error : ')'
2>  TerrainDecal.cpp
2>F:roxetexternincludePython-3.5/token.h(61): warning C4005: 'AT' : macro redefinition
2>          F:roxetexternincludemss.h(1044) : see previous definition of 'AT'
2>F:roxetexternincludePython-3.5/symtable.h(74): error C2065: 'mod_ty' : undeclared identifier
2>F:roxetexternincludePython-3.5/symtable.h(74): error C2146: syntax error : missing ')' before identifier 'mod'
2>F:roxetexternincludePython-3.5/symtable.h(74): error C2491: 'PySymtable_Build' : definition of dllimport data not allowed
2>F:roxetexternincludePython-3.5/symtable.h(76): error C2059: syntax error : ')'
2>F:roxetexternincludePython-3.5/symtable.h(78): error C2065: 'mod_ty' : undeclared identifier
2>F:roxetexternincludePython-3.5/symtable.h(78): error C2146: syntax error : missing ')' before identifier 'mod'
2>F:roxetexternincludePython-3.5/symtable.h(78): error C2491: 'PySymtable_BuildObject' : definition of dllimport data not allowed
2>F:roxetexternincludePython-3.5/symtable.h(80): error C2059: syntax error : ')'
2>  Generating Code...
5>------ Build started: Project: UserInterface, Configuration: Release Win32 ------
5>  StdAfx.cpp
5>F:roxetexternincludePython-3.5/symtable.h(74): error C2065: 'mod_ty' : undeclared identifier
5>F:roxetexternincludePython-3.5/symtable.h(74): error C2146: syntax error : missing ')' before identifier 'mod'
5>F:roxetexternincludePython-3.5/symtable.h(74): error C2491: 'PySymtable_Build' : definition of dllimport data not allowed
5>F:roxetexternincludePython-3.5/symtable.h(76): error C2059: syntax error : ')'
5>F:roxetexternincludePython-3.5/symtable.h(78): error C2065: 'mod_ty' : undeclared identifier
5>F:roxetexternincludePython-3.5/symtable.h(78): error C2146: syntax error : missing ')' before identifier 'mod'
5>F:roxetexternincludePython-3.5/symtable.h(78): error C2491: 'PySymtable_BuildObject' : definition of dllimport data not allowed
5>F:roxetexternincludePython-3.5/symtable.h(80): error C2059: syntax error : ')'
5>F:roxetexternincludemss.h(1044): warning C4005: 'AT' : macro redefinition
5>          F:roxetexternincludePython-3.5/token.h(61) : see previous definition of 'AT'
========== Build: 0 succeeded, 5 failed, 11 up-to-date, 0 skipped ==========

 

 

Link to comment
  • Answers 0
  • Created
  • Last Reply

Top Posters For This Question

Popular Days

Top Posters For This Question

0 answers to this question

Recommended Posts

There have been no answers to this question yet

Create an account or sign in to comment

You need to be a member in order to leave a comment

Create an account

Sign up for a new account in our community. It's easy!

Register a new account

Sign in

Already have an account? Sign in here.

Sign In Now

Announcements

  • -15% Discount in Metin2 Dev Store (01/10/2021 => 31/12/2021) => Code => 15_PCT_OCT_TO_DEC_2021


  • Read our Rules
  • Activity

    1. 1

      Halloween 2021 Ninja M V2

    2. 0

      Visual Studio 2010 Ultimate

    3. 1

      Reduce server memory usage

  • Recently Browsing

    • No registered users viewing this page.

Important Information

Terms of Use / Privacy Policy / Guidelines / We have placed cookies on your device to help make this website better. You can adjust your cookie settings, otherwise we'll assume you're okay to continue.