Jump to content

Recommended Posts

Hello

I'm tryng to compile and i get this error.Has anyone solve this?

linking ../game....
ld: error: unable to find library -lIL
ld: error: unable to find library -lpng
ld: error: unable to find library -ltiff
ld: error: unable to find library -lmng
ld: error: unable to find library -llcms
ld: error: unable to find library -ljpeg
clang-14: error: linker command failed with exit code 1 (use -v to see invocation)
gmake: *** [Makefile:127: ../game] Error 1

  • Cry 1
  • Think 1
Link to comment
https://metin2.dev/topic/28796-unable-to-find-library/
Share on other sites

  • 8 months later...

Don't use any images from : imgur, turkmmop, freakgamers, inforge, hizliresim... Or your content will be deleted without notice...
Use : https://metin2.download/media/add/

Please use https://metin2.download/ when uploading files smaller than 100MB, otherwise the approval will take longer due to manual upload.

Please sign in to comment

You will be able to leave a comment after signing in



Sign In Now
×
×
  • Create New...

Important Information

Terms of Use / Privacy Policy / Guidelines / We have placed cookies on your device to help make this website better. You can adjust your cookie settings, otherwise we'll assume you're okay to continue.