Jump to content

Recommended Posts

Hello metin2dev community...:D

sorry for my bad english...

So i get this error while compiling client source...

1>  Generating Code...
1>C:\Program Files (x86)\MSBuild\Microsoft.Cpp\v4.0\V120\Microsoft.CppBuild.targets(1186,5): error MSB4018: The "VCMessage" task failed unexpectedly.
1>C:\Program Files (x86)\MSBuild\Microsoft.Cpp\v4.0\V120\Microsoft.CppBuild.targets(1186,5): error MSB4018: System.FormatException: Index (zero based) must be greater than or equal to zero and less than the size of the argument list.
1>C:\Program Files (x86)\MSBuild\Microsoft.Cpp\v4.0\V120\Microsoft.CppBuild.targets(1186,5): error MSB4018:    at System.Text.StringBuilder.AppendFormatHelper(IFormatProvider provider, String format, ParamsArray args)
1>C:\Program Files (x86)\MSBuild\Microsoft.Cpp\v4.0\V120\Microsoft.CppBuild.targets(1186,5): error MSB4018:    at System.String.FormatHelper(IFormatProvider provider, String format, ParamsArray args)
1>C:\Program Files (x86)\MSBuild\Microsoft.Cpp\v4.0\V120\Microsoft.CppBuild.targets(1186,5): error MSB4018:    at System.String.Format(IFormatProvider provider, String format, Object[] args)
1>C:\Program Files (x86)\MSBuild\Microsoft.Cpp\v4.0\V120\Microsoft.CppBuild.targets(1186,5): error MSB4018:    at Microsoft.Build.Shared.ResourceUtilities.FormatString(String unformatted, Object[] args)
1>C:\Program Files (x86)\MSBuild\Microsoft.Cpp\v4.0\V120\Microsoft.CppBuild.targets(1186,5): error MSB4018:    at Microsoft.Build.Utilities.TaskLoggingHelper.FormatString(String unformatted, Object[] args)
1>C:\Program Files (x86)\MSBuild\Microsoft.Cpp\v4.0\V120\Microsoft.CppBuild.targets(1186,5): error MSB4018:    at Microsoft.Build.Utilities.TaskLoggingHelper.FormatResourceString(String resourceName, Object[] args)
1>C:\Program Files (x86)\MSBuild\Microsoft.Cpp\v4.0\V120\Microsoft.CppBuild.targets(1186,5): error MSB4018:    at Microsoft.Build.Utilities.TaskLoggingHelper.LogWarningWithCodeFromResources(String messageResourceName, Object[] messageArgs)
1>C:\Program Files (x86)\MSBuild\Microsoft.Cpp\v4.0\V120\Microsoft.CppBuild.targets(1186,5): error MSB4018:    at Microsoft.Build.CPPTasks.VCMessage.Execute()
1>C:\Program Files (x86)\MSBuild\Microsoft.Cpp\v4.0\V120\Microsoft.CppBuild.targets(1186,5): error MSB4018:    at Microsoft.Build.BackEnd.TaskExecutionHost.Microsoft.Build.BackEnd.ITaskExecutionHost.Execute()
1>C:\Program Files (x86)\MSBuild\Microsoft.Cpp\v4.0\V120\Microsoft.CppBuild.targets(1186,5): error MSB4018:    at Microsoft.Build.BackEnd.TaskBuilder.<ExecuteInstantiatedTask>d__20.MoveNext()
========== Build: 0 succeeded, 1 failed, 15 up-to-date, 0 skipped ==========

 

any solution because i tryed a lot of times.

 

and Thnx

Link to comment
https://metin2.dev/topic/13017-errorwhile-compiling-client/
Share on other sites

  • Replies 3
  • Created
  • Last Reply

Top Posters In This Topic

Top Posters In This Topic

Don't use any images from : imgur, turkmmop, freakgamers, inforge, hizliresim... Or your content will be deleted without notice...
Use : https://metin2.download/media/add/

Please use https://metin2.download/ when uploading files smaller than 100MB, otherwise the approval will take longer due to manual upload.

Please sign in to comment

You will be able to leave a comment after signing in



Sign In Now
×
×
  • Create New...

Important Information

Terms of Use / Privacy Policy / Guidelines / We have placed cookies on your device to help make this website better. You can adjust your cookie settings, otherwise we'll assume you're okay to continue.