In file included from cipher.h:6,
from desc.h:7,
from desc_client.h:4,
from char_affect.cpp:10:
../../../Extern/include/cryptopp/cryptlib.h:96: error: integer constant is too large for 'long' type
In file included from debug_allocator.h:5,
from stdafx.h:7,
from char_affect.cpp:2:
/usr/include/c++/4.2/new:95: error: 'operator new' takes type 'size_t' ('unsigned int') as first parameter
/usr/include/c++/4.2/new:96: error: 'operator new' takes type 'size_t' ('unsigned int') as first parameter
/usr/include/c++/4.2/new:99: error: 'operator new' takes type 'size_t' ('unsigned int') as first parameter
/usr/include/c++/4.2/new:100: error: 'operator new' takes type 'size_t' ('unsigned int') as first parameter
/usr/include/c++/4.2/new:105: error: 'operator new' takes type 'size_t' ('unsigned int') as first parameter
/usr/include/c++/4.2/new:106: error: 'operator new' takes type 'size_t' ('unsigned int') as first parameter
Makefile:129: recipe for target 'OBJDIR/ani.o' failed
gmake: *** [OBJDIR/ani.o] Error 1
Makefile:129: recipe for target 'OBJDIR/arena.o' failed
gmake: *** [OBJDIR/arena.o] Error 1
Makefile:129: recipe for target 'OBJDIR/OXEvent.o' failed
gmake: *** [OBJDIR/OXEvent.o] Error 1
Makefile:129: recipe for target 'OBJDIR/castle.o' failed
gmake: *** [OBJDIR/castle.o] Error 1
In file included from cipher.h:6,
from desc.h:7,
from building.cpp:12:
../../../Extern/include/cryptopp/cryptlib.h:96: warning: large integer implicitly truncated to unsigned type
Makefile:129: recipe for target 'OBJDIR/battle.o' failed
gmake: *** [OBJDIR/battle.o] Error 1
In file included from cipher.h:6,
from desc.h:7,
from desc_client.h:4,
from char.cpp:12:
../../../Extern/include/cryptopp/cryptlib.h:96: warning: large integer implicitly truncated to unsigned type
In file included from cipher.h:6,
from desc.h:7,
from desc_client.h:4,
from char_affect.cpp:10:
../../../Extern/include/cryptopp/cryptlib.h:96: warning: large integer implicitly truncated to unsigned type
Makefile:129: recipe for target 'OBJDIR/building.o' failed
gmake: *** [OBJDIR/building.o] Error 1
Makefile:129: recipe for target 'OBJDIR/char_affect.o' failed
gmake: *** [OBJDIR/char_affect.o] Error 1
char.cpp: In member function 'void CHARACTER::PointChange(BYTE, int, bool, bool)':
char.cpp:3079: warning: comparison between signed and unsigned integer expressions
char.cpp: In member function 'void<unnamed>::FuncCheckWarp::operator()(CEntity*)':
char.cpp:6422: warning: overflow in implicit constant conversion
Makefile:129: recipe for target 'OBJDIR/char.o' failed
gmake: *** [OBJDIR/char.o] Error 1
please help me please