Jump to content

shaman21

Banned
  • Posts

    10
  • Joined

  • Last visited

About shaman21

Metin2 Dev

  • Status
    Restricted

Informations

  • Gender
    Male

Recent Profile Visitors

The recent visitors block is disabled and is not being shown to other users.

shaman21's Achievements

Apprentice

Apprentice (3/14)

  • First Post
  • Collaborator
  • Conversation Starter
  • Week One Done
  • One Month Later

Recent Badges

5

Reputation

  1. After two years of searching I bought the patch .. the matter can be closed. beautiful thing aaaaaaaaa https://gyazo.com/c39d0450a6ce18320139e7f2bb3306f9
  2. link: https://mega.nz/folder/j5dgGCiJ#KggopNDZhTV56BmCpEAn2A Vt: https://www.virustotal.com/gui/url/3bbf14a46b8da24004c6a169708043d64780adce0bc516ecb9f25a357f744d32/detection Server name : Metin2 Mega
  3. Error: 0610 16:15:10797 :: File "uiInventory.py", line 1036, in OnUpdate 0610 16:15:10815 :: AttributeError 0610 16:15:10817 :: : 0610 16:15:10817 :: 'int' object has no attribute 'kilit_kapat' 0610 16:15:10817 :: Solution: pc.get_kilit pc.kilitle remove these two functions from the file "quest_functions" that the error disappears.
  4. Hello, how are you? do you disagree? please let me know.
  5. PvP Server - War. Status: 70-30. All details are discussed in private send message to my discord: [SA]Psycho#5023
  6. Hello community I come looking for who sells me this autopatcher specifically! Do not offer me anything other than this one. My discord link: [SA]Psycho#5023 My Skype: live:robso_07
  7. my error - Help Plss: [Hidden Content] deathmatch.cpp: In member function 'void CDeathMatchPvP::OnLogin(LPCHARACTER)': deathmatch.cpp:18:18: error: 'STUN_DEATHMATCH' was not declared in this scope ch->AddAffect(STUN_DEATHMATCH, 0, 0, AFF_STUN, 60*60*60*365, 0, 1, 0); ^~~~~~~~~~~~~~~ deathmatch.cpp:25:17: error: 'PK_MODE_DEATHMATCH' was not declared in this scope ch->SetPKMode(PK_MODE_DEATHMATCH); ^~~~~~~~~~~~~~~~~~ deathmatch.cpp: In member function 'void FDeleteStun::operator()(LPENTITY)': deathmatch.cpp:42:24: error: 'STUN_DEATHMATCH' was not declared in this scope if (ch->FindAffect(STUN_DEATHMATCH)) ^~~~~~~~~~~~~~~ gmake: *** [Makefile:183: .obj/deathmatch.o] Error 1 gmake: *** Waiting for unfinished jobs....
  8. Hello someone could help me solve this error ... When I click the mount it does not appear. sysser: SYSERR: Oct 27 17:36:15.456929 :: Summon: unkown mount [itemVnum 50052, mobVnum 20104, mobType 1 (need 9), owner 10090 LastOrder] She is called the seal goes to the slot below the character but the mount does not appear, this is happening to all even the military horse.
×
×
  • Create New...

Important Information

Terms of Use / Privacy Policy / Guidelines / We have placed cookies on your device to help make this website better. You can adjust your cookie settings, otherwise we'll assume you're okay to continue.