Jump to content

Search the Community

Showing results for tags 'compile'.

  • Search By Tags

    Type tags separated by commas.
  • Search By Author

Content Type


Forums

  • Metin2 Dev
    • Announcements
    • Pillory
    • Praises / Complaints
    • Feedback / Suggestions
  • Community
    • Member Representations
    • Off Topic
    • Games Talk
    • Music / Videos / Art
  • Metin2
    • General
    • Private Servers
  • Help Area
    • Questions & Answers
    • Frequently Asked Questions
  • Releases
    • Guides & HowTo
    • Binaries & Clients / ServerFiles
    • Programming & Scripts / Systems
    • Tools
    • Maps
    • Quests
    • 3D Models
    • 2D Graphics
    • Operating Systems
    • Others
  • Services & Sales
    • Searching
    • Scripts / Systems
    • Models
    • Designs
    • Others
  • Temporary
    • Temporary

Product Groups

  • Advertisements - Classic
  • Advertisements - Pack

Find results in...

Find results that contain...


Date Created

  • Start

    End


Last Updated

  • Start

    End


Filter by number of...

Joined

  • Start

    End


Group


Status


Nationality


Kingdom


Skype


Discord


Website


Mapping


Music / Audio


3D


2D


C++


C#


C


LUA


Python


PHP


SQL


HTML


CSS


JavaScript


Java


FreeBSD


Windows

  1. Can i compile server source code in freebsd 11.2 ? i mean i know its possible, but what i need for this ? i now compile in 9.2 but i dont want it
  2. Hu, im looking for help with compile game source by MaviAy [email protected]:~ # cd /usr/src/fullfilessrc/Server/game/src/ [email protected]:/usr/src/fullfilessrc/Server/game/src # gmake -j20 compiling MarkConvert.cpp compiling MarkImage.cpp compiling MarkManager.cpp compiling OXEvent.cpp compiling blend_item.cpp
  3. I have this error output at the end of my build: Linking...../game_r70140-BETA_release release/guild.o: In function `CGuild::GuildPointChange(unsigned char, int, bool)': guild.cpp:(.text+0x3939): undefined reference to `CGuild::CGuild(CGuild const&)' guild.cpp:(.text+0x39d6): undefined reference to `CGuild::CGuild(CGuild const&)' release/guild.o: In function `CGuild::SkillLevelUp(unsigned int)': guild.cpp:(.text+0x48fb): undefined reference to `CGuild::CGuild(CGuild const&)' guild.cpp:(.text+0x49be): undefined reference to `CGuild::CGuild(CGuild const&)' clang-8: error: lin
  4. Hello all. I have a problem which gives me headaches. I tried to compile all libraries of the external links for the binary source but still with no success. I can compile successfully the binary in release and distribute mode, but in debug mode it gives me this error: 1>eterlib.lib(GrpTextInstance.obj) : error LNK2019: unresolved external symbol "int __cdecl Ymir_WideCharToMultiByte(unsigned int,unsigned long,wchar_t const *,int,char *,int,char const *,int *)" ([email protected]@[email protected]) referenced in function "public: static int __cdecl CGraphi
  5. hello guys, i try to start my client and i get this error... Compile() expected string without null bytes how can i solve this?
  6. Hi. I have problem with compile source db and game ;/ When compile come to end i get error, i try fix them by myself... /usr/bin/ld: skipping incompatible ../../../extern/mysql/lib/libmysqlclient.a when searching for -lmysqlclient /usr/bin/ld: cannot find -lmysqlclient c++: error: linker command failed with exit code 1 (use -v to see invocation) gmake: *** [Makefile:110: /root/game/share/db] Error 1 Thanks for help Makefile https://www.virustotal.com/pl/file/eac68ee6661d20e0f784c02ef7e5d42b52ad0cac9745c70213eb2939560d69cf/analysis/1499722646/
  7. Hello, I am trying to compile client source using VS2008 vc90 (I have installed VS2008 - no Express and vcredists). When I open source using VS2013 and click on "Properties" it says that vc90 is not installed (https://ctrlv.cz/Gr8Y). I have really installed VS2008 (https://ctrlv.cz/93XH) and vcredists(https://ctrlv.cz/uBfT). And When I try to open it with VS2008 it says that: https://ctrlv.cz/Esn2 skype: multidruggist Would you help me please? Thank you.
  8. Hey guys i installed the SSS and i dont know what is wrong but when i login all players are warriors lvl 0 without names and i have this syserr in channel 1 SYSERR: Nov 5 14:44:27.112682 :: GetServerLocation: location error name mapindex 0 0 x 0 empire 3 SYSERR: Nov 5 14:44:27.113866 :: GetServerLocation: location error name mapindex 0 0 x 0 empire 3 SYSERR: Nov 5 14:44:27.114680 :: GetServerLocation: location error name mapindex 0 0 x 0 empire 3 SYSERR: Nov 5 14:44:27.115485 :: GetServerLocation: location error name mapindex 0 0 x 0 empire 3 SYSERR: Nov 5 14:44:27.116204 :: GetServer
  9. Who knows how i can resolve this error in visual studio 2013 when i compile source?
  10. Hey guys, I am using VS 2015 with 2008 v90 toolset. When i start my compiling this message shows up: I dont know why. My settings are correctly: Some1 can help me?
  11. Hello guys, Can someone help me with this error? I don't know what is wrong, maybe wrong Extern folder? Im using Extern folder from mainline in mainline_released... Thank you all for help :-*
  12. Hi m2dev! I have one problem with source in c++11 This is error! And this is Makefile!
  13. Hello metin2dev community... sorry for my bad english... So i get this error while compiling client source... 1> Generating Code... 1>C:\Program Files (x86)\MSBuild\Microsoft.Cpp\v4.0\V120\Microsoft.CppBuild.targets(1186,5): error MSB4018: The "VCMessage" task failed unexpectedly. 1>C:\Program Files (x86)\MSBuild\Microsoft.Cpp\v4.0\V120\Microsoft.CppBuild.targets(1186,5): error MSB4018: System.FormatException: Index (zero based) must be greater than or equal to zero and less than the size of the argument list. 1>C:\Program Files (x86)\MSBuild\Microsoft.Cpp\v4.0
  14. Hello, when i try to compile in release. 16>fatal error C1900: Il mismatch between 'P1' version '20100826' and 'P2' version '20080116' 16>LINK : fatal error LNK1257: code generation failed Can any help me via Teamviewer. I try Visual Basic 08/10/12/15 Skype: taygunnike And when i compile in debug mode and try to start the exe, i got this picture Thanks
  15. Hello dears, I'm trying to compile source on my CentOS server. At this time, when I launch Makefile i receive an error with "strlcopy" function, this is BSD's function, so, I've installed the libbsd-devel and now: It's correct what I'm doing? How i can specify this library? I've try to specify in Makefile with "-L/usr/lib %allpossiblecombinations%". This is the first error that I receive, so I think I receive others in future. Someone that is more prepared than me can please show me the right way? Thanks a lot, Legor.
  16. Hello guys I'm looking for a function (source) that can get the "Specular" value of an item from item_proto and how to use it in an "if" statement... I appreciate any help
  17. Hi m2dev! i have a little problem with my VS....or source of .bin When i try to compile. i got this error! 1>d3dx8.lib(d3dxmath.obj) : error LNK2026: module unsafe for SAFESEH image. 1>d3dx8.lib(cstack.obj) : error LNK2026: module unsafe for SAFESEH image. 1>d3dx8.lib(shapes.obj) : error LNK2026: module unsafe for SAFESEH image. 1>d3dx8.lib(createmesh.obj) : error LNK2026: module unsafe for SAFESEH image. 1>d3dx8.lib(d3dx8tex.obj) : error LNK2026: module unsafe for SAFESEH image. 1>d3dx8.lib(cpudetect.obj) : error LNK2026:
  18. I could compile a file of game ( metin2 ) in windows with GnuWin32 program? The program link I found here: * Gnu Win 32 And I wondered if anyone would know how to work the program or if it would work . Sorry for my bad English .
  19. Hi m2dev! I want to compile vannilla files...but i have 1 little problem utils.h:7:39: note: in definition of macro 'IS_SET' #define IS_SET(flag, bit) ((flag) & (bit)) ^ In file included from ../../../Extern/include/boost/functional/hash/hash.hpp:558:0, from ../../../Extern/include/boost/functional/hash.hpp:6, from ../../../Extern/include/boost/unordered/unordered_map.hpp:21, from ../../../Extern/include/boost/unordered_map.hpp:17, from char.h:4, from char_skill.cpp
  20. Hello guys, so recently i managed to compile my client , and a problem came in. Does anyone here know how to solve this? Thanks!
  21. Hello guys I just noticed a problem that many of you may have with 6/7 attributes and may have ever noticed of it. When I change the 6/7 attributes it changes the bonuses but they come always on their 5th level from the table player.item_attr_rare (ex. if Max HP has lv1 = 200, lv2 = 250, lv3 = 350, lv4 = 400 and lv5 = 500 it fetches only 500). I really need your help on this guys please if anybody has a tip that can help share it below thanks Also if you can help me with this topic I'd appreciate thanks again https://metin2dev.org/board/index.php?/topic/9457-new-resist-flag-for-mob_p
  22. Trying to impement shoulder sash system , i found this error at compiling . This is my char_item.cpp Any help would be appreciated. Thanks , many regards!
  23. utils.cpp:243: warning: NULL used in arithmetic utils.cpp:255: warning: NULL used in arithmetic utils.cpp:269: warning: NULL used in arithmetic compile war_map.cpp compile wedding.cpp compile xmas_event.cpp g++: directory": No such file or directory <command-line>: warning: missing terminating " character version.cpp:10: error: missing terminating " character version.cpp: In function 'void WriteVersion()': version.cpp:10: error: expected primary-expression before ')' token compile panama.cpp gmake: *** [OBJDIR/version.o] Error 1 gmake: *** Waiting for unfinished jobs.... Makefile :
  24. Hi, metin2dev. I receive the next error just before compiling my game. /usr/bin/ld/usr/bin/ld: cannot find -lILDoes enyone know how to fix it? Thanks
  25. Guys i really need to know how to fix this error (syserr) 1026 05:22:36164 :: GRANNY: r:/granny/rt/granny_file_info.cpp(145): File has run-time type tag of 0x8000000f, which doesn't match this version of Granny (0x80000010). Automatic conversion will be attempted. and if u can tell me where can i find this file because i dont have it somewhere. I found a possible solution (with diff patcher to the gr2 files) but im not sure in how many files i need to do this or if my case is different. Please tell me what i need to do to fix this. Sometimes the game crashes from this error (ex. wolfman runni

Metin2 Dev

Metin2 Dev

    You don't have permission to chat.
    ×
    ×
    • Create New...

    Important Information

    Terms of Use / Privacy Policy / Guidelines / We have placed cookies on your device to help make this website better. You can adjust your cookie settings, otherwise we'll assume you're okay to continue.