Jump to content
  • 0

Compile Server



cmd_general.cpp: In function 'void do_ds_change_attr(CHARACTER*, const char*, int, int)':
cmd_general.cpp:3857: warning: comparison is always true due to limited range of data type
cmd_general.cpp: In function 'void do_add_new_attribute(CHARACTER*, const char*, int, int)':
cmd_general.cpp:4041: error: 'class CItem' has no member named 'AddNewAttr'
cmd_general.cpp:4042: error: 'class CItem' has no member named 'AddNewAttr'
cmd_general.cpp:4043: error: 'class CItem' has no member named 'AddNewAttr'
cmd_general.cpp:4044: error: 'class CItem' has no member named 'AddNewAttr'
cmd_general.cpp:4055: error: 'class CItem' has no member named 'AddNewAttr'
cmd_general.cpp:4056: error: 'class CItem' has no member named 'AddNewAttr'
cmd_general.cpp:4057: error: 'class CItem' has no member named 'AddNewAttr'
compiling constants.cpp
compiling crc32.cpp
gmake: *** [.obj/cmd_general.o] Error 1
gmake: *** Waiting for unfinished jobs....



Edited by mohanad1111
Link to post

0 answers to this question

Recommended Posts

There have been no answers to this question yet

Join the conversation

You can post now and register later. If you have an account, sign in now to post with your account.
Note: Your post will require moderator approval before it will be visible.

Answer this question...

×   Pasted as rich text.   Restore formatting

  Only 75 emoji are allowed.

×   Your link has been automatically embedded.   Display as a link instead

×   Your previous content has been restored.   Clear editor

×   You cannot paste images directly. Upload or insert images from URL.

  • Create New...

Important Information

Terms of Use / Privacy Policy / Guidelines / We have placed cookies on your device to help make this website better. You can adjust your cookie settings, otherwise we'll assume you're okay to continue.