Jump to content
  • 0

Erorr when Compile client binary


flygun

Question

  • Former Staff
1>------ Build started: Project: EterLocale, Configuration: Debug Win32 ------
2>------ Build started: Project: CWebBrowser, Configuration: Debug Win32 ------
1>  EterLocale_VC90.vcxproj -> D:HusamMetin2SourceCodenovalineSrcsClientEterLocale.DebugEterLocale.lib
2>  CWebBrowser_VC90.vcxproj -> D:HusamMetin2SourceCodenovalineSrcsClientCWebBrowser.DebugCWebBrowser.lib
3>------ Build started: Project: EffectLib, Configuration: Debug Win32 ------
4>------ Build started: Project: EterPack, Configuration: Debug Win32 ------
4>  EterPack.cpp
3>  EffectMesh.cpp
4>d:husammetin2sourcecodenovalinesrcsclienteterbasefilename.h(236): warning C4996: 'strcpy': This function or variable may be unsafe. Consider using strcpy_s instead. To disable deprecation, use _CRT_SECURE_NO_WARNINGS. See online help for details.
4>          C:Program FilesMicrosoft Visual Studio 11.0VCincludestring.h(110) : see declaration of 'strcpy'
4>  Unknown compiler version - please run the configure tests and report the results
4>D:HusamMetin2SourceCodenovalineSrcsexternincludeboost/unordered/unordered_map.hpp(27): fatal error C1083: Cannot open include file: 'initializer_list': No such file or directory
4>  EterPackCursor.cpp
4>d:husammetin2sourcecodenovalinesrcsclienteterbasefilename.h(236): warning C4996: 'strcpy': This function or variable may be unsafe. Consider using strcpy_s instead. To disable deprecation, use _CRT_SECURE_NO_WARNINGS. See online help for details.
4>          C:Program FilesMicrosoft Visual Studio 11.0VCincludestring.h(110) : see declaration of 'strcpy'
4>  Unknown compiler version - please run the configure tests and report the results
4>D:HusamMetin2SourceCodenovalineSrcsexternincludeboost/unordered/unordered_map.hpp(27): fatal error C1083: Cannot open include file: 'initializer_list': No such file or directory
4>  EterPackManager.cpp
4>d:husammetin2sourcecodenovalinesrcsclienteterbasefilename.h(236): warning C4996: 'strcpy': This function or variable may be unsafe. Consider using strcpy_s instead. To disable deprecation, use _CRT_SECURE_NO_WARNINGS. See online help for details.
4>          C:Program FilesMicrosoft Visual Studio 11.0VCincludestring.h(110) : see declaration of 'strcpy'
4>  Unknown compiler version - please run the configure tests and report the results
4>D:HusamMetin2SourceCodenovalineSrcsexternincludeboost/unordered/unordered_map.hpp(27): fatal error C1083: Cannot open include file: 'initializer_list': No such file or directory
4>  Generating Code...
5>------ Build started: Project: PRTerrainLib, Configuration: Debug Win32 ------
5>  Terrain.cpp
3>  Unknown compiler version - please run the configure tests and report the results
3>D:HusamMetin2SourceCodenovalineSrcsexternincludeboost/unordered/unordered_map.hpp(27): fatal error C1083: Cannot open include file: 'initializer_list': No such file or directory
5>  Unknown compiler version - please run the configure tests and report the results
5>D:HusamMetin2SourceCodenovalineSrcsexternincludeboost/unordered/unordered_map.hpp(27): fatal error C1083: Cannot open include file: 'initializer_list': No such file or directory
6>------ Build started: Project: SpeedTreeLib, Configuration: Debug Win32 ------
7>------ Build started: Project: SphereLib, Configuration: Debug Win32 ------
7>  SphereLib_VC90.vcxproj -> D:HusamMetin2SourceCodenovalineSrcsClientSphereLib.DebugSphereLib.lib
8>------ Build started: Project: eterBase, Configuration: Debug Win32 ------
8>  eterBase_VC90.vcxproj -> D:HusamMetin2SourceCodenovalineSrcsClientEterBase.DebugeterBase.lib
9>------ Build started: Project: eterGrnLib, Configuration: Debug Win32 ------
9>  eterGrnLib_VC90.vcxproj -> D:HusamMetin2SourceCodenovalineSrcsClienteterGrnLib.DebugeterGrnLib.lib
10>------ Build started: Project: eterImageLib, Configuration: Debug Win32 ------
6>  SpeedTreeForest.cpp
10>  eterImageLib_VC90.vcxproj -> D:HusamMetin2SourceCodenovalineSrcsClienteterImageLib.DebugeterImageLib.lib
11>------ Build started: Project: eterPythonLib, Configuration: Debug Win32 ------
11>  PythonGraphic.cpp
6>d:husammetin2sourcecodenovalinesrcsclientspeedtreelib../eterBase/Filename.h(236): warning C4996: 'strcpy': This function or variable may be unsafe. Consider using strcpy_s instead. To disable deprecation, use _CRT_SECURE_NO_WARNINGS. See online help for details.
6>          C:Program FilesMicrosoft Visual Studio 11.0VCincludestring.h(110) : see declaration of 'strcpy'
6>  Unknown compiler version - please run the configure tests and report the results
6>D:HusamMetin2SourceCodenovalineSrcsexternincludeboost/unordered/unordered_map.hpp(27): fatal error C1083: Cannot open include file: 'initializer_list': No such file or directory
11>PythonGraphic.cpp(294): error C2664: 'CPythonGraphic::SaveJPEG' : cannot convert parameter 2 from 'char *' to 'LPBYTE'
11>          Types pointed to are unrelated; conversion requires reinterpret_cast, C-style cast or function-style cast
12>------ Build started: Project: eterlib, Configuration: Debug Win32 ------
13>------ Build started: Project: gamelib, Configuration: Debug Win32 ------
12>  FileLoaderThread.cpp
13>  RaceManager.cpp
12>  Unknown compiler version - please run the configure tests and report the results
12>D:HusamMetin2SourceCodenovalineSrcsexternincludeboost/unordered/unordered_map.hpp(27): fatal error C1083: Cannot open include file: 'initializer_list': No such file or directory
12>  Util.cpp
12>  Unknown compiler version - please run the configure tests and report the results
12>D:HusamMetin2SourceCodenovalineSrcsexternincludeboost/unordered/unordered_map.hpp(27): fatal error C1083: Cannot open include file: 'initializer_list': No such file or directory
12>  Resource.cpp
12>  Unknown compiler version - please run the configure tests and report the results
12>D:HusamMetin2SourceCodenovalineSrcsexternincludeboost/unordered/unordered_map.hpp(27): fatal error C1083: Cannot open include file: 'initializer_list': No such file or directory
12>  ResourceManager.cpp
12>  Unknown compiler version - please run the configure tests and report the results
12>D:HusamMetin2SourceCodenovalineSrcsexternincludeboost/unordered/unordered_map.hpp(27): fatal error C1083: Cannot open include file: 'initializer_list': No such file or directory
12>  GrpImageTexture.cpp
12>  Unknown compiler version - please run the configure tests and report the results
12>D:HusamMetin2SourceCodenovalineSrcsexternincludeboost/unordered/unordered_map.hpp(27): fatal error C1083: Cannot open include file: 'initializer_list': No such file or directory
12>  TextFileLoader.cpp
12>  Unknown compiler version - please run the configure tests and report the results
12>D:HusamMetin2SourceCodenovalineSrcsexternincludeboost/unordered/unordered_map.hpp(27): fatal error C1083: Cannot open include file: 'initializer_list': No such file or directory
12>  Generating Code...
14>------ Build started: Project: mileslib, Configuration: Debug Win32 ------
14>  SoundData.cpp
14>  Unknown compiler version - please run the configure tests and report the results
13>  Unknown compiler version - please run the configure tests and report the results
13>D:HusamMetin2SourceCodenovalineSrcsexternincludeboost/unordered/unordered_map.hpp(27): fatal error C1083: Cannot open include file: 'initializer_list': No such file or directory
14>D:HusamMetin2SourceCodenovalineSrcsexternincludeboost/unordered/unordered_map.hpp(27): fatal error C1083: Cannot open include file: 'initializer_list': No such file or directory
13>  Area.cpp
15>------ Build started: Project: scriptLib, Configuration: Debug Win32 ------
13>  Unknown compiler version - please run the configure tests and report the results
13>D:HusamMetin2SourceCodenovalineSrcsexternincludeboost/unordered/unordered_map.hpp(27): fatal error C1083: Cannot open include file: 'initializer_list': No such file or directory
13>  AreaTerrain.cpp
13>  Unknown compiler version - please run the configure tests and report the results
13>D:HusamMetin2SourceCodenovalineSrcsexternincludeboost/unordered/unordered_map.hpp(27): fatal error C1083: Cannot open include file: 'initializer_list': No such file or directory
13>  MapManager.cpp
13>  Unknown compiler version - please run the configure tests and report the results
13>D:HusamMetin2SourceCodenovalineSrcsexternincludeboost/unordered/unordered_map.hpp(27): fatal error C1083: Cannot open include file: 'initializer_list': No such file or directory
13>  MapOutdoorLoad.cpp
13>  Unknown compiler version - please run the configure tests and report the results
13>D:HusamMetin2SourceCodenovalineSrcsexternincludeboost/unordered/unordered_map.hpp(27): fatal error C1083: Cannot open include file: 'initializer_list': No such file or directory
13>  Property.cpp
13>  Unknown compiler version - please run the configure tests and report the results
13>D:HusamMetin2SourceCodenovalineSrcsexternincludeboost/unordered/unordered_map.hpp(27): fatal error C1083: Cannot open include file: 'initializer_list': No such file or directory
13>  PropertyLoader.cpp
13>  Unknown compiler version - please run the configure tests and report the results
13>D:HusamMetin2SourceCodenovalineSrcsexternincludeboost/unordered/unordered_map.hpp(27): fatal error C1083: Cannot open include file: 'initializer_list': No such file or directory
13>  PropertyManager.cpp
13>  Unknown compiler version - please run the configure tests and report the results
13>D:HusamMetin2SourceCodenovalineSrcsexternincludeboost/unordered/unordered_map.hpp(27): fatal error C1083: Cannot open include file: 'initializer_list': No such file or directory
13>  ItemManager.cpp
13>  Unknown compiler version - please run the configure tests and report the results
13>D:HusamMetin2SourceCodenovalineSrcsexternincludeboost/unordered/unordered_map.hpp(27): fatal error C1083: Cannot open include file: 'initializer_list': No such file or directory
13>  FlyingInstance.cpp
15>  PythonLauncher.cpp
15>PythonLauncher.cpp(1): warning C4652: compiler option 'Generate Browser Info' inconsistent with precompiled header; current command-line option will override that defined in the precompiled header
15>  Unknown compiler version - please run the configure tests and report the results
13>  Unknown compiler version - please run the configure tests and report the results
13>D:HusamMetin2SourceCodenovalineSrcsexternincludeboost/unordered/unordered_map.hpp(27): fatal error C1083: Cannot open include file: 'initializer_list': No such file or directory
13>  Generating Code...
15>D:HusamMetin2SourceCodenovalineSrcsexternincludeboost/unordered/unordered_map.hpp(27): fatal error C1083: Cannot open include file: 'initializer_list': No such file or directory
16>------ Build started: Project: UserInterface, Configuration: Debug Win32 ------
16>  AffectFlagContainer.cpp
16>AffectFlagContainer.cpp(68): error C2440: 'initializing' : cannot convert from 'CAffectFlagContainer::Element' to 'char &'
16>  InstanceBase.cpp
16>  Unknown compiler version - please run the configure tests and report the results
16>D:HusamMetin2SourceCodenovalineSrcsexternincludeboost/unordered/unordered_map.hpp(27): fatal error C1083: Cannot open include file: 'initializer_list': No such file or directory
16>  InstanceBaseBattle.cpp
16>  Unknown compiler version - please run the configure tests and report the results
16>D:HusamMetin2SourceCodenovalineSrcsexternincludeboost/unordered/unordered_map.hpp(27): fatal error C1083: Cannot open include file: 'initializer_list': No such file or directory
16>  InstanceBaseMovement.cpp
16>  Unknown compiler version - please run the configure tests and report the results
16>D:HusamMetin2SourceCodenovalineSrcsexternincludeboost/unordered/unordered_map.hpp(27): fatal error C1083: Cannot open include file: 'initializer_list': No such file or directory
16>  InstanceBaseTransform.cpp
16>  Unknown compiler version - please run the configure tests and report the results
16>D:HusamMetin2SourceCodenovalineSrcsexternincludeboost/unordered/unordered_map.hpp(27): fatal error C1083: Cannot open include file: 'initializer_list': No such file or directory
16>  CameraProcedure.cpp
16>  Unknown compiler version - please run the configure tests and report the results
16>D:HusamMetin2SourceCodenovalineSrcsexternincludeboost/unordered/unordered_map.hpp(27): fatal error C1083: Cannot open include file: 'initializer_list': No such file or directory
16>  PythonBackground.cpp
16>  Unknown compiler version - please run the configure tests and report the results
16>D:HusamMetin2SourceCodenovalineSrcsexternincludeboost/unordered/unordered_map.hpp(27): fatal error C1083: Cannot open include file: 'initializer_list': No such file or directory
16>  PythonBackgroundModule.cpp
16>  Unknown compiler version - please run the configure tests and report the results
16>D:HusamMetin2SourceCodenovalineSrcsexternincludeboost/unordered/unordered_map.hpp(27): fatal error C1083: Cannot open include file: 'initializer_list': No such file or directory
16>  PythonCharacterManager.cpp
16>  Unknown compiler version - please run the configure tests and report the results
16>D:HusamMetin2SourceCodenovalineSrcsexternincludeboost/unordered/unordered_map.hpp(27): fatal error C1083: Cannot open include file: 'initializer_list': No such file or directory
16>  PythonCharacterManagerModule.cpp
16>  Unknown compiler version - please run the configure tests and report the results
16>D:HusamMetin2SourceCodenovalineSrcsexternincludeboost/unordered/unordered_map.hpp(27): fatal error C1083: Cannot open include file: 'initializer_list': No such file or directory
16>  PythonEventManager.cpp
16>d:husammetin2sourcecodenovalinesrcsclientuserinterfacepacket.h(2792): warning C4305: 'initializing' : truncation from '' to 'char'
16>d:husammetin2sourcecodenovalinesrcsclientuserinterfacepacket.h(2792): warning C4309: 'initializing' : truncation of constant value
16>d:husammetin2sourcecodenovalinesrcsclientuserinterfacepacket.h(2801): warning C4305: 'initializing' : truncation from '' to 'char'
16>d:husammetin2sourcecodenovalinesrcsclientuserinterfacepacket.h(2801): warning C4309: 'initializing' : truncation of constant value
16>  Unknown compiler version - please run the configure tests and report the results
16>D:HusamMetin2SourceCodenovalineSrcsexternincludeboost/unordered/unordered_map.hpp(27): fatal error C1083: Cannot open include file: 'initializer_list': No such file or directory
16>  PythonItem.cpp
16>  Unknown compiler version - please run the configure tests and report the results
16>D:HusamMetin2SourceCodenovalineSrcsexternincludeboost/unordered/unordered_map.hpp(27): fatal error C1083: Cannot open include file: 'initializer_list': No such file or directory
16>  PythonNonPlayer.cpp
16>  Unknown compiler version - please run the configure tests and report the results
16>D:HusamMetin2SourceCodenovalineSrcsexternincludeboost/unordered/unordered_map.hpp(27): fatal error C1083: Cannot open include file: 'initializer_list': No such file or directory
16>  PythonPlayer.cpp
16>d:husammetin2sourcecodenovalinesrcsclientuserinterfacepacket.h(2792): warning C4305: 'initializing' : truncation from '' to 'char'
16>d:husammetin2sourcecodenovalinesrcsclientuserinterfacepacket.h(2792): warning C4309: 'initializing' : truncation of constant value
16>d:husammetin2sourcecodenovalinesrcsclientuserinterfacepacket.h(2801): warning C4305: 'initializing' : truncation from '' to 'char'
16>d:husammetin2sourcecodenovalinesrcsclientuserinterfacepacket.h(2801): warning C4309: 'initializing' : truncation of constant value
16>  Unknown compiler version - please run the configure tests and report the results
16>D:HusamMetin2SourceCodenovalineSrcsexternincludeboost/unordered/unordered_map.hpp(27): fatal error C1083: Cannot open include file: 'initializer_list': No such file or directory
16>  PythonPlayerInput.cpp
16>d:husammetin2sourcecodenovalinesrcsclientuserinterfacePacket.h(2792): warning C4305: 'initializing' : truncation from '' to 'char'
16>d:husammetin2sourcecodenovalinesrcsclientuserinterfacePacket.h(2792): warning C4309: 'initializing' : truncation of constant value
16>d:husammetin2sourcecodenovalinesrcsclientuserinterfacePacket.h(2801): warning C4305: 'initializing' : truncation from '' to 'char'
16>d:husammetin2sourcecodenovalinesrcsclientuserinterfacePacket.h(2801): warning C4309: 'initializing' : truncation of constant value
16>  Unknown compiler version - please run the configure tests and report the results
16>D:HusamMetin2SourceCodenovalineSrcsexternincludeboost/unordered/unordered_map.hpp(27): fatal error C1083: Cannot open include file: 'initializer_list': No such file or directory
16>  PythonPlayerInputMouse.cpp
16>d:husammetin2sourcecodenovalinesrcsclientuserinterfacePacket.h(2792): warning C4305: 'initializing' : truncation from '' to 'char'
16>d:husammetin2sourcecodenovalinesrcsclientuserinterfacePacket.h(2792): warning C4309: 'initializing' : truncation of constant value
16>d:husammetin2sourcecodenovalinesrcsclientuserinterfacePacket.h(2801): warning C4305: 'initializing' : truncation from '' to 'char'
16>d:husammetin2sourcecodenovalinesrcsclientuserinterfacePacket.h(2801): warning C4309: 'initializing' : truncation of constant value
16>  Unknown compiler version - please run the configure tests and report the results
16>D:HusamMetin2SourceCodenovalineSrcsexternincludeboost/unordered/unordered_map.hpp(27): fatal error C1083: Cannot open include file: 'initializer_list': No such file or directory
16>  PythonPlayerModule.cpp
16>d:husammetin2sourcecodenovalinesrcsclientuserinterfacePacket.h(2792): warning C4305: 'initializing' : truncation from '' to 'char'
16>d:husammetin2sourcecodenovalinesrcsclientuserinterfacePacket.h(2792): warning C4309: 'initializing' : truncation of constant value
16>d:husammetin2sourcecodenovalinesrcsclientuserinterfacePacket.h(2801): warning C4305: 'initializing' : truncation from '' to 'char'
16>d:husammetin2sourcecodenovalinesrcsclientuserinterfacePacket.h(2801): warning C4309: 'initializing' : truncation of constant value
16>  Unknown compiler version - please run the configure tests and report the results
16>D:HusamMetin2SourceCodenovalineSrcsexternincludeboost/unordered/unordered_map.hpp(27): fatal error C1083: Cannot open include file: 'initializer_list': No such file or directory
16>  PythonSkill.cpp
16>  Unknown compiler version - please run the configure tests and report the results
16>D:HusamMetin2SourceCodenovalineSrcsexternincludeboost/unordered/unordered_map.hpp(27): fatal error C1083: Cannot open include file: 'initializer_list': No such file or directory
16>  PythonMiniMap.cpp
16>  Unknown compiler version - please run the configure tests and report the results
16>D:HusamMetin2SourceCodenovalineSrcsexternincludeboost/unordered/unordered_map.hpp(27): fatal error C1083: Cannot open include file: 'initializer_list': No such file or directory
16>  PythonMiniMapModule.cpp
16>  Unknown compiler version - please run the configure tests and report the results
16>D:HusamMetin2SourceCodenovalineSrcsexternincludeboost/unordered/unordered_map.hpp(27): fatal error C1083: Cannot open include file: 'initializer_list': No such file or directory
16>  Generating Code...
16>  Compiling...
16>  PythonShop.cpp
16>d:husammetin2sourcecodenovalinesrcsclientuserinterfacePacket.h(2792): warning C4305: 'initializing' : truncation from '' to 'char'
16>d:husammetin2sourcecodenovalinesrcsclientuserinterfacePacket.h(2792): warning C4309: 'initializing' : truncation of constant value
16>d:husammetin2sourcecodenovalinesrcsclientuserinterfacePacket.h(2801): warning C4305: 'initializing' : truncation from '' to 'char'
16>d:husammetin2sourcecodenovalinesrcsclientuserinterfacePacket.h(2801): warning C4309: 'initializing' : truncation of constant value
16>PythonShop.cpp(31): warning C4309: 'return' : truncation of constant value
16>PythonShop.cpp(330): error C2665: 'PyTuple_GetInteger' : none of the 3 overloads could convert all the argument types
16>          d:husammetin2sourcecodenovalinesrcsclientscriptlibPythonUtils.h(6): could be 'bool PyTuple_GetInteger(PyObject *,int,unsigned char *)'
16>          d:husammetin2sourcecodenovalinesrcsclientscriptlibPythonUtils.h(7): or       'bool PyTuple_GetInteger(PyObject *,int,int *)'
16>          d:husammetin2sourcecodenovalinesrcsclientscriptlibPythonUtils.h(8): or       'bool PyTuple_GetInteger(PyObject *,int,WORD *)'
16>          while trying to match the argument list '(PyObject *, int, char *)'
16>PythonShop.cpp(348): error C2665: 'PyTuple_GetInteger' : none of the 3 overloads could convert all the argument types
16>          d:husammetin2sourcecodenovalinesrcsclientscriptlibPythonUtils.h(6): could be 'bool PyTuple_GetInteger(PyObject *,int,unsigned char *)'
16>          d:husammetin2sourcecodenovalinesrcsclientscriptlibPythonUtils.h(7): or       'bool PyTuple_GetInteger(PyObject *,int,int *)'
16>          d:husammetin2sourcecodenovalinesrcsclientscriptlibPythonUtils.h(8): or       'bool PyTuple_GetInteger(PyObject *,int,WORD *)'
16>          while trying to match the argument list '(PyObject *, int, char *)'
16>PythonShop.cpp(360): error C2665: 'PyTuple_GetInteger' : none of the 3 overloads could convert all the argument types
16>          d:husammetin2sourcecodenovalinesrcsclientscriptlibPythonUtils.h(6): could be 'bool PyTuple_GetInteger(PyObject *,int,unsigned char *)'
16>          d:husammetin2sourcecodenovalinesrcsclientscriptlibPythonUtils.h(7): or       'bool PyTuple_GetInteger(PyObject *,int,int *)'
16>          d:husammetin2sourcecodenovalinesrcsclientscriptlibPythonUtils.h(8): or       'bool PyTuple_GetInteger(PyObject *,int,WORD *)'
16>          while trying to match the argument list '(PyObject *, int, char *)'
16>PythonShop.cpp(387): error C2665: 'PyTuple_GetInteger' : none of the 3 overloads could convert all the argument types
16>          d:husammetin2sourcecodenovalinesrcsclientscriptlibPythonUtils.h(6): could be 'bool PyTuple_GetInteger(PyObject *,int,unsigned char *)'
16>          d:husammetin2sourcecodenovalinesrcsclientscriptlibPythonUtils.h(7): or       'bool PyTuple_GetInteger(PyObject *,int,int *)'
16>          d:husammetin2sourcecodenovalinesrcsclientscriptlibPythonUtils.h(8): or       'bool PyTuple_GetInteger(PyObject *,int,WORD *)'
16>          while trying to match the argument list '(PyObject *, int, char *)'
16>PythonShop.cpp(396): error C2665: 'PyTuple_GetInteger' : none of the 3 overloads could convert all the argument types
16>          d:husammetin2sourcecodenovalinesrcsclientscriptlibPythonUtils.h(6): could be 'bool PyTuple_GetInteger(PyObject *,int,unsigned char *)'
16>          d:husammetin2sourcecodenovalinesrcsclientscriptlibPythonUtils.h(7): or       'bool PyTuple_GetInteger(PyObject *,int,int *)'
16>          d:husammetin2sourcecodenovalinesrcsclientscriptlibPythonUtils.h(8): or       'bool PyTuple_GetInteger(PyObject *,int,WORD *)'
16>          while trying to match the argument list '(PyObject *, int, char *)'
16>  PythonPackModule.cpp
16>  Unknown compiler version - please run the configure tests and report the results
16>D:HusamMetin2SourceCodenovalineSrcsexternincludeboost/unordered/unordered_map.hpp(27): fatal error C1083: Cannot open include file: 'initializer_list': No such file or directory
16>  PythonApplication.cpp
16>d:husammetin2sourcecodenovalinesrcsclientuserinterfacePacket.h(2792): warning C4305: 'initializing' : truncation from '' to 'char'
16>d:husammetin2sourcecodenovalinesrcsclientuserinterfacePacket.h(2792): warning C4309: 'initializing' : truncation of constant value
16>d:husammetin2sourcecodenovalinesrcsclientuserinterfacePacket.h(2801): warning C4305: 'initializing' : truncation from '' to 'char'
16>d:husammetin2sourcecodenovalinesrcsclientuserinterfacePacket.h(2801): warning C4309: 'initializing' : truncation of constant value
16>  Unknown compiler version - please run the configure tests and report the results
16>D:HusamMetin2SourceCodenovalineSrcsexternincludeboost/unordered/unordered_map.hpp(27): fatal error C1083: Cannot open include file: 'initializer_list': No such file or directory
16>  PythonApplicationCamera.cpp
16>d:husammetin2sourcecodenovalinesrcsclientuserinterfacePacket.h(2792): warning C4305: 'initializing' : truncation from '' to 'char'
16>d:husammetin2sourcecodenovalinesrcsclientuserinterfacePacket.h(2792): warning C4309: 'initializing' : truncation of constant value
16>d:husammetin2sourcecodenovalinesrcsclientuserinterfacePacket.h(2801): warning C4305: 'initializing' : truncation from '' to 'char'
16>d:husammetin2sourcecodenovalinesrcsclientuserinterfacePacket.h(2801): warning C4309: 'initializing' : truncation of constant value
16>  Unknown compiler version - please run the configure tests and report the results
16>D:HusamMetin2SourceCodenovalineSrcsexternincludeboost/unordered/unordered_map.hpp(27): fatal error C1083: Cannot open include file: 'initializer_list': No such file or directory
16>  PythonApplicationCursor.cpp
16>d:husammetin2sourcecodenovalinesrcsclientuserinterfacePacket.h(2792): warning C4305: 'initializing' : truncation from '' to 'char'
16>d:husammetin2sourcecodenovalinesrcsclientuserinterfacePacket.h(2792): warning C4309: 'initializing' : truncation of constant value
16>d:husammetin2sourcecodenovalinesrcsclientuserinterfacePacket.h(2801): warning C4305: 'initializing' : truncation from '' to 'char'
16>d:husammetin2sourcecodenovalinesrcsclientuserinterfacePacket.h(2801): warning C4309: 'initializing' : truncation of constant value
16>  Unknown compiler version - please run the configure tests and report the results
16>D:HusamMetin2SourceCodenovalineSrcsexternincludeboost/unordered/unordered_map.hpp(27): fatal error C1083: Cannot open include file: 'initializer_list': No such file or directory
16>  PythonApplicationEvent.cpp
16>d:husammetin2sourcecodenovalinesrcsclientuserinterfacePacket.h(2792): warning C4305: 'initializing' : truncation from '' to 'char'
16>d:husammetin2sourcecodenovalinesrcsclientuserinterfacePacket.h(2792): warning C4309: 'initializing' : truncation of constant value
16>d:husammetin2sourcecodenovalinesrcsclientuserinterfacePacket.h(2801): warning C4305: 'initializing' : truncation from '' to 'char'
16>d:husammetin2sourcecodenovalinesrcsclientuserinterfacePacket.h(2801): warning C4309: 'initializing' : truncation of constant value
16>  Unknown compiler version - please run the configure tests and report the results
16>D:HusamMetin2SourceCodenovalineSrcsexternincludeboost/unordered/unordered_map.hpp(27): fatal error C1083: Cannot open include file: 'initializer_list': No such file or directory
16>  PythonApplicationLogo.cpp
16>d:husammetin2sourcecodenovalinesrcsclientuserinterfacePacket.h(2792): warning C4305: 'initializing' : truncation from '' to 'char'
16>d:husammetin2sourcecodenovalinesrcsclientuserinterfacePacket.h(2792): warning C4309: 'initializing' : truncation of constant value
16>d:husammetin2sourcecodenovalinesrcsclientuserinterfacePacket.h(2801): warning C4305: 'initializing' : truncation from '' to 'char'
16>d:husammetin2sourcecodenovalinesrcsclientuserinterfacePacket.h(2801): warning C4309: 'initializing' : truncation of constant value
16>  Unknown compiler version - please run the configure tests and report the results
16>D:HusamMetin2SourceCodenovalineSrcsexternincludeboost/unordered/unordered_map.hpp(27): fatal error C1083: Cannot open include file: 'initializer_list': No such file or directory
16>  PythonApplicationModule.cpp
16>d:husammetin2sourcecodenovalinesrcsclientuserinterfacePacket.h(2792): warning C4305: 'initializing' : truncation from '' to 'char'
16>d:husammetin2sourcecodenovalinesrcsclientuserinterfacePacket.h(2792): warning C4309: 'initializing' : truncation of constant value
16>d:husammetin2sourcecodenovalinesrcsclientuserinterfacePacket.h(2801): warning C4305: 'initializing' : truncation from '' to 'char'
16>d:husammetin2sourcecodenovalinesrcsclientuserinterfacePacket.h(2801): warning C4309: 'initializing' : truncation of constant value
16>  Unknown compiler version - please run the configure tests and report the results
16>D:HusamMetin2SourceCodenovalineSrcsexternincludeboost/unordered/unordered_map.hpp(27): fatal error C1083: Cannot open include file: 'initializer_list': No such file or directory
16>  PythonApplicationProcedure.cpp
16>d:husammetin2sourcecodenovalinesrcsclientuserinterfacePacket.h(2792): warning C4305: 'initializing' : truncation from '' to 'char'
16>d:husammetin2sourcecodenovalinesrcsclientuserinterfacePacket.h(2792): warning C4309: 'initializing' : truncation of constant value
16>d:husammetin2sourcecodenovalinesrcsclientuserinterfacePacket.h(2801): warning C4305: 'initializing' : truncation from '' to 'char'
16>d:husammetin2sourcecodenovalinesrcsclientuserinterfacePacket.h(2801): warning C4309: 'initializing' : truncation of constant value
16>  Unknown compiler version - please run the configure tests and report the results
16>D:HusamMetin2SourceCodenovalineSrcsexternincludeboost/unordered/unordered_map.hpp(27): fatal error C1083: Cannot open include file: 'initializer_list': No such file or directory
16>  PythonApplicationWebPage.cpp
16>d:husammetin2sourcecodenovalinesrcsclientuserinterfacePacket.h(2792): warning C4305: 'initializing' : truncation from '' to 'char'
16>d:husammetin2sourcecodenovalinesrcsclientuserinterfacePacket.h(2792): warning C4309: 'initializing' : truncation of constant value
16>d:husammetin2sourcecodenovalinesrcsclientuserinterfacePacket.h(2801): warning C4305: 'initializing' : truncation from '' to 'char'
16>d:husammetin2sourcecodenovalinesrcsclientuserinterfacePacket.h(2801): warning C4309: 'initializing' : truncation of constant value
16>  Unknown compiler version - please run the configure tests and report the results
16>D:HusamMetin2SourceCodenovalineSrcsexternincludeboost/unordered/unordered_map.hpp(27): fatal error C1083: Cannot open include file: 'initializer_list': No such file or directory
16>  PythonIMEModule.cpp
16>d:husammetin2sourcecodenovalinesrcsclientuserinterfacePacket.h(2792): warning C4305: 'initializing' : truncation from '' to 'char'
16>d:husammetin2sourcecodenovalinesrcsclientuserinterfacePacket.h(2792): warning C4309: 'initializing' : truncation of constant value
16>d:husammetin2sourcecodenovalinesrcsclientuserinterfacePacket.h(2801): warning C4305: 'initializing' : truncation from '' to 'char'
16>d:husammetin2sourcecodenovalinesrcsclientuserinterfacePacket.h(2801): warning C4309: 'initializing' : truncation of constant value
16>  Unknown compiler version - please run the configure tests and report the results
16>D:HusamMetin2SourceCodenovalineSrcsexternincludeboost/unordered/unordered_map.hpp(27): fatal error C1083: Cannot open include file: 'initializer_list': No such file or directory
16>  PythonSoundManagerModule.cpp
16>d:husammetin2sourcecodenovalinesrcsclientuserinterfacePacket.h(2792): warning C4305: 'initializing' : truncation from '' to 'char'
16>d:husammetin2sourcecodenovalinesrcsclientuserinterfacePacket.h(2792): warning C4309: 'initializing' : truncation of constant value
16>d:husammetin2sourcecodenovalinesrcsclientuserinterfacePacket.h(2801): warning C4305: 'initializing' : truncation from '' to 'char'
16>d:husammetin2sourcecodenovalinesrcsclientuserinterfacePacket.h(2801): warning C4309: 'initializing' : truncation of constant value
16>  Unknown compiler version - please run the configure tests and report the results
16>D:HusamMetin2SourceCodenovalineSrcsexternincludeboost/unordered/unordered_map.hpp(27): fatal error C1083: Cannot open include file: 'initializer_list': No such file or directory
16>  PythonSystem.cpp
16>d:husammetin2sourcecodenovalinesrcsclientuserinterfacePacket.h(2792): warning C4305: 'initializing' : truncation from '' to 'char'
16>d:husammetin2sourcecodenovalinesrcsclientuserinterfacePacket.h(2792): warning C4309: 'initializing' : truncation of constant value
16>d:husammetin2sourcecodenovalinesrcsclientuserinterfacePacket.h(2801): warning C4305: 'initializing' : truncation from '' to 'char'
16>d:husammetin2sourcecodenovalinesrcsclientuserinterfacePacket.h(2801): warning C4309: 'initializing' : truncation of constant value
16>  Unknown compiler version - please run the configure tests and report the results
16>D:HusamMetin2SourceCodenovalineSrcsexternincludeboost/unordered/unordered_map.hpp(27): fatal error C1083: Cannot open include file: 'initializer_list': No such file or directory
16>  MarkImage.cpp
16>MarkImage.cpp(190): error C2664: 'lzo1x_decompress_safe' : cannot convert parameter 1 from 'const char *' to 'const unsigned char *'
16>          Types pointed to are unrelated; conversion requires reinterpret_cast, C-style cast or function-style cast
16>MarkImage.cpp(305): error C2664: 'lzo1x_999_compress' : cannot convert parameter 1 from 'const char *' to 'const unsigned char *'
16>          Types pointed to are unrelated; conversion requires reinterpret_cast, C-style cast or function-style cast
16>  Locale.cpp
16>d:husammetin2sourcecodenovalinesrcsclientuserinterfacePacket.h(2792): warning C4305: 'initializing' : truncation from '' to 'char'
16>d:husammetin2sourcecodenovalinesrcsclientuserinterfacePacket.h(2792): warning C4309: 'initializing' : truncation of constant value
16>d:husammetin2sourcecodenovalinesrcsclientuserinterfacePacket.h(2801): warning C4305: 'initializing' : truncation from '' to 'char'
16>d:husammetin2sourcecodenovalinesrcsclientuserinterfacePacket.h(2801): warning C4309: 'initializing' : truncation of constant value
16>  Unknown compiler version - please run the configure tests and report the results
16>D:HusamMetin2SourceCodenovalineSrcsexternincludeboost/unordered/unordered_map.hpp(27): fatal error C1083: Cannot open include file: 'initializer_list': No such file or directory
16>  AccountConnector.cpp
16>d:husammetin2sourcecodenovalinesrcsclientuserinterfacePacket.h(2792): warning C4305: 'initializing' : truncation from '' to 'char'
16>d:husammetin2sourcecodenovalinesrcsclientuserinterfacePacket.h(2792): warning C4309: 'initializing' : truncation of constant value
16>d:husammetin2sourcecodenovalinesrcsclientuserinterfacePacket.h(2801): warning C4305: 'initializing' : truncation from '' to 'char'
16>d:husammetin2sourcecodenovalinesrcsclientuserinterfacePacket.h(2801): warning C4309: 'initializing' : truncation of constant value
16>  Unknown compiler version - please run the configure tests and report the results
16>D:HusamMetin2SourceCodenovalineSrcsexternincludeboost/unordered/unordered_map.hpp(27): fatal error C1083: Cannot open include file: 'initializer_list': No such file or directory
16>  PythonNetworkStreamModule.cpp
16>d:husammetin2sourcecodenovalinesrcsclientuserinterfacepacket.h(2792): warning C4305: 'initializing' : truncation from '' to 'char'
16>d:husammetin2sourcecodenovalinesrcsclientuserinterfacepacket.h(2792): warning C4309: 'initializing' : truncation of constant value
16>d:husammetin2sourcecodenovalinesrcsclientuserinterfacepacket.h(2801): warning C4305: 'initializing' : truncation from '' to 'char'
16>d:husammetin2sourcecodenovalinesrcsclientuserinterfacepacket.h(2801): warning C4309: 'initializing' : truncation of constant value
16>PythonNetworkStreamModule.cpp(678): error C2664: 'PyTuple_GetByte' : cannot convert parameter 3 from 'char *' to 'unsigned char *'
16>          Types pointed to are unrelated; conversion requires reinterpret_cast, C-style cast or function-style cast
16>PythonNetworkStreamModule.cpp(706): error C2664: 'PyTuple_GetByte' : cannot convert parameter 3 from 'char *' to 'unsigned char *'
16>          Types pointed to are unrelated; conversion requires reinterpret_cast, C-style cast or function-style cast
16>PythonNetworkStreamModule.cpp(712): error C2664: 'PyTuple_GetByte' : cannot convert parameter 3 from 'char *' to 'unsigned char *'
16>          Types pointed to are unrelated; conversion requires reinterpret_cast, C-style cast or function-style cast
16>PythonNetworkStreamModule.cpp(736): error C2664: 'PyTuple_GetByte' : cannot convert parameter 3 from 'char *' to 'unsigned char *'
16>          Types pointed to are unrelated; conversion requires reinterpret_cast, C-style cast or function-style cast
16>PythonNetworkStreamModule.cpp(765): error C2664: 'PyTuple_GetByte' : cannot convert parameter 3 from 'char *' to 'unsigned char *'
16>          Types pointed to are unrelated; conversion requires reinterpret_cast, C-style cast or function-style cast
16>PythonNetworkStreamModule.cpp(821): error C2664: 'PyTuple_GetByte' : cannot convert parameter 3 from 'char *' to 'unsigned char *'
16>          Types pointed to are unrelated; conversion requires reinterpret_cast, C-style cast or function-style cast
16>PythonNetworkStreamModule.cpp(825): error C2664: 'PyTuple_GetByte' : cannot convert parameter 3 from 'char *' to 'unsigned char *'
16>          Types pointed to are unrelated; conversion requires reinterpret_cast, C-style cast or function-style cast
16>PythonNetworkStreamModule.cpp(871): error C2664: 'PyTuple_GetByte' : cannot convert parameter 3 from 'char *' to 'unsigned char *'
16>          Types pointed to are unrelated; conversion requires reinterpret_cast, C-style cast or function-style cast
16>PythonNetworkStreamModule.cpp(953): error C2665: 'PyTuple_GetInteger' : none of the 3 overloads could convert all the argument types
16>          d:husammetin2sourcecodenovalinesrcsclientscriptlibPythonUtils.h(6): could be 'bool PyTuple_GetInteger(PyObject *,int,unsigned char *)'
16>          d:husammetin2sourcecodenovalinesrcsclientscriptlibPythonUtils.h(7): or       'bool PyTuple_GetInteger(PyObject *,int,int *)'
16>          d:husammetin2sourcecodenovalinesrcsclientscriptlibPythonUtils.h(8): or       'bool PyTuple_GetInteger(PyObject *,int,WORD *)'
16>          while trying to match the argument list '(PyObject *, int, char *)'
16>PythonNetworkStreamModule.cpp(1222): error C2665: 'PyTuple_GetInteger' : none of the 3 overloads could convert all the argument types
16>          d:husammetin2sourcecodenovalinesrcsclientscriptlibPythonUtils.h(6): could be 'bool PyTuple_GetInteger(PyObject *,int,unsigned char *)'
16>          d:husammetin2sourcecodenovalinesrcsclientscriptlibPythonUtils.h(7): or       'bool PyTuple_GetInteger(PyObject *,int,int *)'
16>          d:husammetin2sourcecodenovalinesrcsclientscriptlibPythonUtils.h(8): or       'bool PyTuple_GetInteger(PyObject *,int,WORD *)'
16>          while trying to match the argument list '(PyObject *, int, char *)'
16>PythonNetworkStreamModule.cpp(1254): error C2665: 'PyTuple_GetInteger' : none of the 3 overloads could convert all the argument types
16>          d:husammetin2sourcecodenovalinesrcsclientscriptlibPythonUtils.h(6): could be 'bool PyTuple_GetInteger(PyObject *,int,unsigned char *)'
16>          d:husammetin2sourcecodenovalinesrcsclientscriptlibPythonUtils.h(7): or       'bool PyTuple_GetInteger(PyObject *,int,int *)'
16>          d:husammetin2sourcecodenovalinesrcsclientscriptlibPythonUtils.h(8): or       'bool PyTuple_GetInteger(PyObject *,int,WORD *)'
16>          while trying to match the argument list '(PyObject *, int, char *)'
16>PythonNetworkStreamModule.cpp(1303): error C2665: 'PyTuple_GetInteger' : none of the 3 overloads could convert all the argument types
16>          d:husammetin2sourcecodenovalinesrcsclientscriptlibPythonUtils.h(6): could be 'bool PyTuple_GetInteger(PyObject *,int,unsigned char *)'
16>          d:husammetin2sourcecodenovalinesrcsclientscriptlibPythonUtils.h(7): or       'bool PyTuple_GetInteger(PyObject *,int,int *)'
16>          d:husammetin2sourcecodenovalinesrcsclientscriptlibPythonUtils.h(8): or       'bool PyTuple_GetInteger(PyObject *,int,WORD *)'
16>          while trying to match the argument list '(PyObject *, int, char *)'
16>  PythonNetworkStreamPhaseGame.cpp
16>d:husammetin2sourcecodenovalinesrcsclientuserinterfacepacket.h(2792): warning C4305: 'initializing' : truncation from '' to 'char'
16>d:husammetin2sourcecodenovalinesrcsclientuserinterfacepacket.h(2792): warning C4309: 'initializing' : truncation of constant value
16>d:husammetin2sourcecodenovalinesrcsclientuserinterfacepacket.h(2801): warning C4305: 'initializing' : truncation from '' to 'char'
16>d:husammetin2sourcecodenovalinesrcsclientuserinterfacepacket.h(2801): warning C4309: 'initializing' : truncation of constant value
16>  Unknown compiler version - please run the configure tests and report the results
16>D:HusamMetin2SourceCodenovalineSrcsexternincludeboost/unordered/unordered_map.hpp(27): fatal error C1083: Cannot open include file: 'initializer_list': No such file or directory
16>  PythonNetworkStreamPhaseGameActor.cpp
16>d:husammetin2sourcecodenovalinesrcsclientuserinterfacepacket.h(2792): warning C4305: 'initializing' : truncation from '' to 'char'
16>d:husammetin2sourcecodenovalinesrcsclientuserinterfacepacket.h(2792): warning C4309: 'initializing' : truncation of constant value
16>d:husammetin2sourcecodenovalinesrcsclientuserinterfacepacket.h(2801): warning C4305: 'initializing' : truncation from '' to 'char'
16>d:husammetin2sourcecodenovalinesrcsclientuserinterfacepacket.h(2801): warning C4309: 'initializing' : truncation of constant value
16>  Unknown compiler version - please run the configure tests and report the results
16>D:HusamMetin2SourceCodenovalineSrcsexternincludeboost/unordered/unordered_map.hpp(27): fatal error C1083: Cannot open include file: 'initializer_list': No such file or directory
16>  PythonNetworkStreamPhaseHandShake.cpp
16>d:husammetin2sourcecodenovalinesrcsclientuserinterfacepacket.h(2792): warning C4305: 'initializing' : truncation from '' to 'char'
16>d:husammetin2sourcecodenovalinesrcsclientuserinterfacepacket.h(2792): warning C4309: 'initializing' : truncation of constant value
16>d:husammetin2sourcecodenovalinesrcsclientuserinterfacepacket.h(2801): warning C4305: 'initializing' : truncation from '' to 'char'
16>d:husammetin2sourcecodenovalinesrcsclientuserinterfacepacket.h(2801): warning C4309: 'initializing' : truncation of constant value
16>  Unknown compiler version - please run the configure tests and report the results
16>D:HusamMetin2SourceCodenovalineSrcsexternincludeboost/unordered/unordered_map.hpp(27): fatal error C1083: Cannot open include file: 'initializer_list': No such file or directory
16>  Generating Code...
16>  Compiling...
16>  PythonNetworkStreamPhaseLoading.cpp
16>d:husammetin2sourcecodenovalinesrcsclientuserinterfacepacket.h(2792): warning C4305: 'initializing' : truncation from '' to 'char'
16>d:husammetin2sourcecodenovalinesrcsclientuserinterfacepacket.h(2792): warning C4309: 'initializing' : truncation of constant value
16>d:husammetin2sourcecodenovalinesrcsclientuserinterfacepacket.h(2801): warning C4305: 'initializing' : truncation from '' to 'char'
16>d:husammetin2sourcecodenovalinesrcsclientuserinterfacepacket.h(2801): warning C4309: 'initializing' : truncation of constant value
16>  Unknown compiler version - please run the configure tests and report the results
16>D:HusamMetin2SourceCodenovalineSrcsexternincludeboost/unordered/unordered_map.hpp(27): fatal error C1083: Cannot open include file: 'initializer_list': No such file or directory
16>  PythonNetworkStreamPhaseOffline.cpp
16>d:husammetin2sourcecodenovalinesrcsclientuserinterfacepacket.h(2792): warning C4305: 'initializing' : truncation from '' to 'char'
16>d:husammetin2sourcecodenovalinesrcsclientuserinterfacepacket.h(2792): warning C4309: 'initializing' : truncation of constant value
16>d:husammetin2sourcecodenovalinesrcsclientuserinterfacepacket.h(2801): warning C4305: 'initializing' : truncation from '' to 'char'
16>d:husammetin2sourcecodenovalinesrcsclientuserinterfacepacket.h(2801): warning C4309: 'initializing' : truncation of constant value
16>  Unknown compiler version - please run the configure tests and report the results
16>D:HusamMetin2SourceCodenovalineSrcsexternincludeboost/unordered/unordered_map.hpp(27): fatal error C1083: Cannot open include file: 'initializer_list': No such file or directory
16>  MovieMan.cpp
16>d:husammetin2sourcecodenovalinesrcsclientuserinterfacePacket.h(2792): warning C4305: 'initializing' : truncation from '' to 'char'
16>d:husammetin2sourcecodenovalinesrcsclientuserinterfacePacket.h(2792): warning C4309: 'initializing' : truncation of constant value
16>d:husammetin2sourcecodenovalinesrcsclientuserinterfacePacket.h(2801): warning C4305: 'initializing' : truncation from '' to 'char'
16>d:husammetin2sourcecodenovalinesrcsclientuserinterfacePacket.h(2801): warning C4309: 'initializing' : truncation of constant value
16>  Unknown compiler version - please run the configure tests and report the results
16>D:HusamMetin2SourceCodenovalineSrcsexternincludeboost/unordered/unordered_map.hpp(27): fatal error C1083: Cannot open include file: 'initializer_list': No such file or directory
16>  UserInterface.cpp
16>d:husammetin2sourcecodenovalinesrcsclientuserinterfacePacket.h(2792): warning C4305: 'initializing' : truncation from '' to 'char'
16>d:husammetin2sourcecodenovalinesrcsclientuserinterfacePacket.h(2792): warning C4309: 'initializing' : truncation of constant value
16>d:husammetin2sourcecodenovalinesrcsclientuserinterfacePacket.h(2801): warning C4305: 'initializing' : truncation from '' to 'char'
16>d:husammetin2sourcecodenovalinesrcsclientuserinterfacePacket.h(2801): warning C4309: 'initializing' : truncation of constant value
16>  Unknown compiler version - please run the configure tests and report the results
16>D:HusamMetin2SourceCodenovalineSrcsexternincludeboost/unordered/unordered_map.hpp(27): fatal error C1083: Cannot open include file: 'initializer_list': No such file or directory
16>  Generating Code...
========== Build: 6 succeeded, 10 failed, 0 up-to-date, 0 skipped ==========

i'm in deep problem

Link to comment
  • Answers 0
  • Created
  • Last Reply

Top Posters For This Question

Popular Days

Top Posters For This Question

Popular Days

0 answers to this question

Recommended Posts

There have been no answers to this question yet

Create an account or sign in to comment

You need to be a member in order to leave a comment

Create an account

Sign up for a new account in our community. It's easy!

Register a new account

Sign in

Already have an account? Sign in here.

Sign In Now


×
×
  • Create New...

Important Information

Terms of Use / Privacy Policy / Guidelines / We have placed cookies on your device to help make this website better. You can adjust your cookie settings, otherwise we'll assume you're okay to continue.