Jump to content

ThunderGoTT

Member
  • Posts

    4
  • Joined

  • Last visited

About ThunderGoTT

Informations

  • Gender
    Male

Recent Profile Visitors

1,028 profile views
  • Zor

ThunderGoTT's Achievements

Rookie

Rookie (2/14)

  • First Post
  • Conversation Starter
  • Week One Done
  • One Month Later
  • One Year In

Recent Badges

0

Reputation

  1. Hey Community, I Can,t compile 40k binary Creating temporary file "d:\Source Binary\Client\UserInterface\Release\RSP0000632580180.rsp" with contents [ /Od /I "../../extern/include" /D "WIN32" /D "NDEBUG" /D "_WINDOWS" /D "USE_LOD" /D "DUNGEON_WORK" /D "_VC80_UPGRADE=0x0710" /D "_MBCS" /FD /EHsc /MT /Yu"stdafx.h" /Fp".\Release/UserInterface.pch" /Fo".\Release/" /Fd".\Release/" /FR".\Release\\" /W3 /c /Zi ".\AffectFlagContainer.cpp" ".\UserInterface.cpp" ".\MovieMan.cpp" ".\GameType.cpp" ".\WiseLogicXTrap.cpp" ".\NProtectGameGuard.cpp" ".\Hackshield.cpp" ".\CheckLatestFiles.cpp" ".\ServerStateCheckerModule.cpp" ".\ServerStateChecker.cpp" ".\PythonNetworkStreamPhaseSelect.cpp" ".\PythonNetworkStreamPhaseOffline.cpp" ".\PythonNetworkStreamPhaseLogin.cpp" ".\PythonNetworkStreamPhaseLoading.cpp" ".\PythonNetworkStreamPhaseHandShake.cpp" ".\PythonNetworkStreamPhaseGameItem.cpp" ".\PythonNetworkStreamPhaseGameActor.cpp" ".\PythonNetworkStreamPhaseGame.cpp" ".\PythonNetworkStreamModule.cpp" ".\PythonNetworkStreamEvent.cpp" ".\PythonNetworkStreamCommand.cpp" ".\PythonNetworkStream.cpp" ".\PythonNetworkDatagramModule.cpp" ".\PythonNetworkDatagram.cpp" ".\PythonExceptionSender.cpp" ".\ProcessCRC.cpp" ".\NetworkActorManager.cpp" ".\InsultChecker.cpp" ".\AccountConnector.cpp" ".\Locale.cpp" ".\MarkManager.cpp" ".\MarkImage.cpp" ".\GuildMarkUploader.cpp" ".\GuildMarkDownloader.cpp" ".\PythonSystemModule.cpp" ".\PythonSystem.cpp" ".\PythonSoundManagerModule.cpp" ".\PythonProfilerModule.cpp" ".\PythonIMEModule.cpp" ".\PythonIME.cpp" ".\PythonApplicationWebPage.cpp" ".\PythonApplicationProcedure.cpp" ".\PythonApplicationModule.cpp" ".\PythonApplicationLogo.cpp" ".\PythonApplicationEvent.cpp" ".\PythonApplicationCursor.cpp" ".\PythonApplicationCamera.cpp" ".\PythonApplication.cpp" ".\ProcessScanner.cpp" ".\PythonPackModule.cpp" ".\PythonTextTailModule.cpp" ".\PythonTextTail.cpp" ".\PythonShop.cpp" ".\PythonSafeBox.cpp" ".\PythonMiniMapModule.cpp" ".\PythonMiniMap.cpp" ".\PythonMessenger.cpp" ".\PythonGuild.cpp" ".\PythonFlyModule.cpp" ".\PythonExchangeModule.cpp" ".\PythonExchange.cpp" ".\PythonChatModule.cpp" ".\PythonChat.cpp" ".\PythonSkill.cpp" ".\PythonQuest.cpp" ".\PythonPlayerSkill.cpp" ".\PythonPlayerModule.cpp" ".\PythonPlayerInputMouse.cpp" ".\PythonPlayerInputKeyboard.cpp" ".\PythonPlayerInput.cpp" ".\PythonPlayerEventHandler.cpp" ".\PythonPlayer.cpp" ".\PythonNonPlayerModule.cpp" ".\PythonNonPlayer.cpp" ".\PythonItemModule.cpp" ".\PythonItem.cpp" ".\PythonGameEventManagerModule.cpp" ".\PythonEventManagerMoudle.cpp" ".\PythonEventManager.cpp" ".\PythonEffectModule.cpp" ".\PythonCharacterModule.cpp" ".\PythonCharacterManagerModule.cpp" ".\PythonCharacterManager.cpp" ".\PythonBackgroundModule.cpp" ".\PythonBackground.cpp" ".\CameraProcedure.cpp" ".\InstanceBaseTransform.cpp" ".\InstanceBaseMovement.cpp" ".\InstanceBaseMotion.cpp" ".\InstanceBaseEvent.cpp" ".\InstanceBaseEffect.cpp" ".\InstanceBaseBattle.cpp" ".\InstanceBase.cpp" ] Creating command line "cl.exe @"d:\Source Binary\Client\UserInterface\Release\RSP0000632580180.rsp" /nologo /errorReport:prompt" Creating temporary file "d:\Source Binary\Client\UserInterface\Release\RSP0000642580180.rsp" with contents [ /Od /I "../../extern/include" /D "WIN32" /D "NDEBUG" /D "_WINDOWS" /D "USE_LOD" /D "DUNGEON_WORK" /D "_VC80_UPGRADE=0x0710" /D "_MBCS" /FD /EHsc /MT /Yc"stdafx.h" /Fp".\Release/UserInterface.pch" /Fo".\Release/" /Fd".\Release/" /FR".\Release\\" /W3 /c /Zi ".\StdAfx.cpp" ] Creating command line "cl.exe @"d:\Source Binary\Client\UserInterface\Release\RSP0000642580180.rsp" /nologo /errorReport:prompt" Creating temporary file "d:\Source Binary\Client\UserInterface\Release\RSP0000652580180.rsp" with contents [ /o "../bin/UserInterface.bsc" ".\Release\InstanceBase.sbr" ".\Release\InstanceBaseBattle.sbr" ".\Release\InstanceBaseEffect.sbr" ".\Release\InstanceBaseEvent.sbr" ".\Release\InstanceBaseMotion.sbr" ".\Release\InstanceBaseMovement.sbr" ".\Release\InstanceBaseTransform.sbr" ".\Release\CameraProcedure.sbr" ".\Release\PythonBackground.sbr" ".\Release\PythonBackgroundModule.sbr" ".\Release\PythonCharacterManager.sbr" ".\Release\PythonCharacterManagerModule.sbr" ".\Release\PythonCharacterModule.sbr" ".\Release\PythonEffectModule.sbr" ".\Release\PythonEventManager.sbr" ".\Release\PythonEventManagerMoudle.sbr" ".\Release\PythonGameEventManagerModule.sbr" ".\Release\PythonItem.sbr" ".\Release\PythonItemModule.sbr" ".\Release\PythonNonPlayer.sbr" ".\Release\PythonNonPlayerModule.sbr" ".\Release\PythonPlayer.sbr" ".\Release\PythonPlayerEventHandler.sbr" ".\Release\PythonPlayerInput.sbr" ".\Release\PythonPlayerInputKeyboard.sbr" ".\Release\PythonPlayerInputMouse.sbr" ".\Release\PythonPlayerModule.sbr" ".\Release\PythonPlayerSkill.sbr" ".\Release\PythonQuest.sbr" ".\Release\PythonSkill.sbr" ".\Release\PythonChat.sbr" ".\Release\PythonChatModule.sbr" ".\Release\PythonExchange.sbr" ".\Release\PythonExchangeModule.sbr" ".\Release\PythonFlyModule.sbr" ".\Release\PythonGuild.sbr" ".\Release\PythonMessenger.sbr" ".\Release\PythonMiniMap.sbr" ".\Release\PythonMiniMapModule.sbr" ".\Release\PythonSafeBox.sbr" ".\Release\PythonShop.sbr" ".\Release\PythonTextTail.sbr" ".\Release\PythonTextTailModule.sbr" ".\Release\PythonPackModule.sbr" ".\Release\ProcessScanner.sbr" ".\Release\PythonApplication.sbr" ".\Release\PythonApplicationCamera.sbr" ".\Release\PythonApplicationCursor.sbr" ".\Release\PythonApplicationEvent.sbr" ".\Release\PythonApplicationLogo.sbr" ".\Release\PythonApplicationModule.sbr" ".\Release\PythonApplicationProcedure.sbr" ".\Release\PythonApplicationWebPage.sbr" ".\Release\PythonIME.sbr" ".\Release\PythonIMEModule.sbr" ".\Release\PythonProfilerModule.sbr" ".\Release\PythonSoundManagerModule.sbr" ".\Release\PythonSystem.sbr" ".\Release\PythonSystemModule.sbr" ".\Release\GuildMarkDownloader.sbr" ".\Release\GuildMarkUploader.sbr" ".\Release\MarkImage.sbr" ".\Release\MarkManager.sbr" ".\Release\Locale.sbr" ".\Release\AccountConnector.sbr" ".\Release\InsultChecker.sbr" ".\Release\NetworkActorManager.sbr" ".\Release\ProcessCRC.sbr" ".\Release\PythonExceptionSender.sbr" ".\Release\PythonNetworkDatagram.sbr" ".\Release\PythonNetworkDatagramModule.sbr" ".\Release\PythonNetworkStream.sbr" ".\Release\PythonNetworkStreamCommand.sbr" ".\Release\PythonNetworkStreamEvent.sbr" ".\Release\PythonNetworkStreamModule.sbr" ".\Release\PythonNetworkStreamPhaseGame.sbr" ".\Release\PythonNetworkStreamPhaseGameActor.sbr" ".\Release\PythonNetworkStreamPhaseGameItem.sbr" ".\Release\PythonNetworkStreamPhaseHandShake.sbr" ".\Release\PythonNetworkStreamPhaseLoading.sbr" ".\Release\PythonNetworkStreamPhaseLogin.sbr" ".\Release\PythonNetworkStreamPhaseOffline.sbr" ".\Release\PythonNetworkStreamPhaseSelect.sbr" ".\Release\ServerStateChecker.sbr" ".\Release\ServerStateCheckerModule.sbr" ".\Release\CheckLatestFiles.sbr" ".\Release\Hackshield.sbr" ".\Release\NProtectGameGuard.sbr" ".\Release\WiseLogicXTrap.sbr" ".\Release\GameType.sbr" ".\Release\MovieMan.sbr" ".\Release\StdAfx.sbr" ".\Release\UserInterface.sbr" ".\Release\AffectFlagContainer.sbr" ] Creating command line "bscmake.exe @"d:\Source Binary\Client\UserInterface\Release\RSP0000652580180.rsp" /nologo" Output Window Compiling... StdAfx.cpp Compiling... AffectFlagContainer.cpp .\AffectFlagContainer.cpp(68) : error C2440: 'initializing' : cannot convert from 'CAffectFlagContainer::Element' to 'char &' UserInterface.cpp d:\source binary\client\userinterface\Packet.h(2792) : warning C4305: 'initializing' : truncation from '' to 'char' d:\source binary\client\userinterface\Packet.h(2792) : warning C4309: 'initializing' : truncation of constant value d:\source binary\client\userinterface\Packet.h(2801) : warning C4305: 'initializing' : truncation from '' to 'char' d:\source binary\client\userinterface\Packet.h(2801) : warning C4309: 'initializing' : truncation of constant value MovieMan.cpp d:\source binary\client\userinterface\Packet.h(2792) : warning C4305: 'initializing' : truncation from '' to 'char' d:\source binary\client\userinterface\Packet.h(2792) : warning C4309: 'initializing' : truncation of constant value d:\source binary\client\userinterface\Packet.h(2801) : warning C4305: 'initializing' : truncation from '' to 'char' d:\source binary\client\userinterface\Packet.h(2801) : warning C4309: 'initializing' : truncation of constant value GameType.cpp WiseLogicXTrap.cpp NProtectGameGuard.cpp Hackshield.cpp CheckLatestFiles.cpp ServerStateCheckerModule.cpp ServerStateChecker.cpp d:\source binary\client\userinterface\Packet.h(2792) : warning C4305: 'initializing' : truncation from '' to 'char' d:\source binary\client\userinterface\Packet.h(2792) : warning C4309: 'initializing' : truncation of constant value d:\source binary\client\userinterface\Packet.h(2801) : warning C4305: 'initializing' : truncation from '' to 'char' d:\source binary\client\userinterface\Packet.h(2801) : warning C4309: 'initializing' : truncation of constant value .\ServerStateChecker.cpp(60) : warning C4305: 'initializing' : truncation from '' to 'char' .\ServerStateChecker.cpp(60) : warning C4309: 'initializing' : truncation of constant value PythonNetworkStreamPhaseSelect.cpp d:\source binary\client\userinterface\packet.h(2792) : warning C4305: 'initializing' : truncation from '' to 'char' d:\source binary\client\userinterface\packet.h(2792) : warning C4309: 'initializing' : truncation of constant value d:\source binary\client\userinterface\packet.h(2801) : warning C4305: 'initializing' : truncation from '' to 'char' d:\source binary\client\userinterface\packet.h(2801) : warning C4309: 'initializing' : truncation of constant value PythonNetworkStreamPhaseOffline.cpp d:\source binary\client\userinterface\packet.h(2792) : warning C4305: 'initializing' : truncation from '' to 'char' d:\source binary\client\userinterface\packet.h(2792) : warning C4309: 'initializing' : truncation of constant value d:\source binary\client\userinterface\packet.h(2801) : warning C4305: 'initializing' : truncation from '' to 'char' d:\source binary\client\userinterface\packet.h(2801) : warning C4309: 'initializing' : truncation of constant value PythonNetworkStreamPhaseLogin.cpp d:\source binary\client\userinterface\packet.h(2792) : warning C4305: 'initializing' : truncation from '' to 'char' d:\source binary\client\userinterface\packet.h(2792) : warning C4309: 'initializing' : truncation of constant value d:\source binary\client\userinterface\packet.h(2801) : warning C4305: 'initializing' : truncation from '' to 'char' d:\source binary\client\userinterface\packet.h(2801) : warning C4309: 'initializing' : truncation of constant value .\PythonNetworkStreamPhaseLogin.cpp(321) : warning C4305: '=' : truncation from '' to 'char' .\PythonNetworkStreamPhaseLogin.cpp(321) : warning C4309: '=' : truncation of constant value .\PythonNetworkStreamPhaseLogin.cpp(356) : warning C4305: '=' : truncation from '' to 'char' .\PythonNetworkStreamPhaseLogin.cpp(356) : warning C4309: '=' : truncation of constant value PythonNetworkStreamPhaseLoading.cpp d:\source binary\client\userinterface\packet.h(2792) : warning C4305: 'initializing' : truncation from '' to 'char' d:\source binary\client\userinterface\packet.h(2792) : warning C4309: 'initializing' : truncation of constant value d:\source binary\client\userinterface\packet.h(2801) : warning C4305: 'initializing' : truncation from '' to 'char' d:\source binary\client\userinterface\packet.h(2801) : warning C4309: 'initializing' : truncation of constant value PythonNetworkStreamPhaseHandShake.cpp d:\source binary\client\userinterface\packet.h(2792) : warning C4305: 'initializing' : truncation from '' to 'char' d:\source binary\client\userinterface\packet.h(2792) : warning C4309: 'initializing' : truncation of constant value d:\source binary\client\userinterface\packet.h(2801) : warning C4305: 'initializing' : truncation from '' to 'char' d:\source binary\client\userinterface\packet.h(2801) : warning C4309: 'initializing' : truncation of constant value .\PythonNetworkStreamPhaseHandShake.cpp(140) : warning C4305: '=' : truncation from '' to 'char' .\PythonNetworkStreamPhaseHandShake.cpp(140) : warning C4309: '=' : truncation of constant value .\PythonNetworkStreamPhaseHandShake.cpp(232) : warning C4305: '=' : truncation from '' to 'char' .\PythonNetworkStreamPhaseHandShake.cpp(232) : warning C4309: '=' : truncation of constant value .\PythonNetworkStreamPhaseHandShake.cpp(320) : warning C4305: '=' : truncation from '' to 'char' .\PythonNetworkStreamPhaseHandShake.cpp(320) : warning C4309: '=' : truncation of constant value PythonNetworkStreamPhaseGameItem.cpp d:\source binary\client\userinterface\packet.h(2792) : warning C4305: 'initializing' : truncation from '' to 'char' d:\source binary\client\userinterface\packet.h(2792) : warning C4309: 'initializing' : truncation of constant value d:\source binary\client\userinterface\packet.h(2801) : warning C4305: 'initializing' : truncation from '' to 'char' d:\source binary\client\userinterface\packet.h(2801) : warning C4309: 'initializing' : truncation of constant value PythonNetworkStreamPhaseGameActor.cpp d:\source binary\client\userinterface\packet.h(2792) : warning C4305: 'initializing' : truncation from '' to 'char' d:\source binary\client\userinterface\packet.h(2792) : warning C4309: 'initializing' : truncation of constant value d:\source binary\client\userinterface\packet.h(2801) : warning C4305: 'initializing' : truncation from '' to 'char' d:\source binary\client\userinterface\packet.h(2801) : warning C4309: 'initializing' : truncation of constant value PythonNetworkStreamPhaseGame.cpp d:\source binary\client\userinterface\packet.h(2792) : warning C4305: 'initializing' : truncation from '' to 'char' d:\source binary\client\userinterface\packet.h(2792) : warning C4309: 'initializing' : truncation of constant value d:\source binary\client\userinterface\packet.h(2801) : warning C4305: 'initializing' : truncation from '' to 'char' d:\source binary\client\userinterface\packet.h(2801) : warning C4309: 'initializing' : truncation of constant value .\PythonNetworkStreamPhaseGame.cpp(4154) : warning C4305: '=' : truncation from '' to 'char' .\PythonNetworkStreamPhaseGame.cpp(4154) : warning C4309: '=' : truncation of constant value .\PythonNetworkStreamPhaseGame.cpp(4167) : warning C4305: '=' : truncation from '' to 'char' .\PythonNetworkStreamPhaseGame.cpp(4167) : warning C4309: '=' : truncation of constant value .\PythonNetworkStreamPhaseGame.cpp(4432) : warning C4305: '=' : truncation from '' to 'char' .\PythonNetworkStreamPhaseGame.cpp(4432) : warning C4309: '=' : truncation of constant value PythonNetworkStreamModule.cpp d:\source binary\client\userinterface\packet.h(2792) : warning C4305: 'initializing' : truncation from '' to 'char' d:\source binary\client\userinterface\packet.h(2792) : warning C4309: 'initializing' : truncation of constant value d:\source binary\client\userinterface\packet.h(2801) : warning C4305: 'initializing' : truncation from '' to 'char' d:\source binary\client\userinterface\packet.h(2801) : warning C4309: 'initializing' : truncation of constant value .\PythonNetworkStreamModule.cpp(678) : error C2664: 'PyTuple_GetByte' : cannot convert parameter 3 from 'char *' to 'unsigned char *' Types pointed to are unrelated; conversion requires reinterpret_cast, C-style cast or function-style cast .\PythonNetworkStreamModule.cpp(706) : error C2664: 'PyTuple_GetByte' : cannot convert parameter 3 from 'char *' to 'unsigned char *' Types pointed to are unrelated; conversion requires reinterpret_cast, C-style cast or function-style cast .\PythonNetworkStreamModule.cpp(712) : error C2664: 'PyTuple_GetByte' : cannot convert parameter 3 from 'char *' to 'unsigned char *' Types pointed to are unrelated; conversion requires reinterpret_cast, C-style cast or function-style cast .\PythonNetworkStreamModule.cpp(736) : error C2664: 'PyTuple_GetByte' : cannot convert parameter 3 from 'char *' to 'unsigned char *' Types pointed to are unrelated; conversion requires reinterpret_cast, C-style cast or function-style cast .\PythonNetworkStreamModule.cpp(765) : error C2664: 'PyTuple_GetByte' : cannot convert parameter 3 from 'char *' to 'unsigned char *' Types pointed to are unrelated; conversion requires reinterpret_cast, C-style cast or function-style cast .\PythonNetworkStreamModule.cpp(821) : error C2664: 'PyTuple_GetByte' : cannot convert parameter 3 from 'char *' to 'unsigned char *' Types pointed to are unrelated; conversion requires reinterpret_cast, C-style cast or function-style cast .\PythonNetworkStreamModule.cpp(825) : error C2664: 'PyTuple_GetByte' : cannot convert parameter 3 from 'char *' to 'unsigned char *' Types pointed to are unrelated; conversion requires reinterpret_cast, C-style cast or function-style cast .\PythonNetworkStreamModule.cpp(871) : error C2664: 'PyTuple_GetByte' : cannot convert parameter 3 from 'char *' to 'unsigned char *' Types pointed to are unrelated; conversion requires reinterpret_cast, C-style cast or function-style cast .\PythonNetworkStreamModule.cpp(953) : error C2665: 'PyTuple_GetInteger' : none of the 3 overloads could convert all the argument types d:\source binary\client\scriptlib\PythonUtils.h(6): could be 'bool PyTuple_GetInteger(PyObject *,int,unsigned char *)' d:\source binary\client\scriptlib\PythonUtils.h(7): or 'bool PyTuple_GetInteger(PyObject *,int,int *)' d:\source binary\client\scriptlib\PythonUtils.h(8): or 'bool PyTuple_GetInteger(PyObject *,int,WORD *)' while trying to match the argument list '(PyObject *, int, char *)' .\PythonNetworkStreamModule.cpp(1222) : error C2665: 'PyTuple_GetInteger' : none of the 3 overloads could convert all the argument types d:\source binary\client\scriptlib\PythonUtils.h(6): could be 'bool PyTuple_GetInteger(PyObject *,int,unsigned char *)' d:\source binary\client\scriptlib\PythonUtils.h(7): or 'bool PyTuple_GetInteger(PyObject *,int,int *)' d:\source binary\client\scriptlib\PythonUtils.h(8): or 'bool PyTuple_GetInteger(PyObject *,int,WORD *)' while trying to match the argument list '(PyObject *, int, char *)' .\PythonNetworkStreamModule.cpp(1254) : error C2665: 'PyTuple_GetInteger' : none of the 3 overloads could convert all the argument types d:\source binary\client\scriptlib\PythonUtils.h(6): could be 'bool PyTuple_GetInteger(PyObject *,int,unsigned char *)' d:\source binary\client\scriptlib\PythonUtils.h(7): or 'bool PyTuple_GetInteger(PyObject *,int,int *)' d:\source binary\client\scriptlib\PythonUtils.h(8): or 'bool PyTuple_GetInteger(PyObject *,int,WORD *)' while trying to match the argument list '(PyObject *, int, char *)' .\PythonNetworkStreamModule.cpp(1303) : error C2665: 'PyTuple_GetInteger' : none of the 3 overloads could convert all the argument types d:\source binary\client\scriptlib\PythonUtils.h(6): could be 'bool PyTuple_GetInteger(PyObject *,int,unsigned char *)' d:\source binary\client\scriptlib\PythonUtils.h(7): or 'bool PyTuple_GetInteger(PyObject *,int,int *)' d:\source binary\client\scriptlib\PythonUtils.h(8): or 'bool PyTuple_GetInteger(PyObject *,int,WORD *)' while trying to match the argument list '(PyObject *, int, char *)' PythonNetworkStreamEvent.cpp d:\source binary\client\userinterface\packet.h(2792) : warning C4305: 'initializing' : truncation from '' to 'char' d:\source binary\client\userinterface\packet.h(2792) : warning C4309: 'initializing' : truncation of constant value d:\source binary\client\userinterface\packet.h(2801) : warning C4305: 'initializing' : truncation from '' to 'char' d:\source binary\client\userinterface\packet.h(2801) : warning C4309: 'initializing' : truncation of constant value Generating Code... Compiling... PythonNetworkStreamCommand.cpp d:\source binary\client\userinterface\packet.h(2792) : warning C4305: 'initializing' : truncation from '' to 'char' d:\source binary\client\userinterface\packet.h(2792) : warning C4309: 'initializing' : truncation of constant value d:\source binary\client\userinterface\packet.h(2801) : warning C4305: 'initializing' : truncation from '' to 'char' d:\source binary\client\userinterface\packet.h(2801) : warning C4309: 'initializing' : truncation of constant value PythonNetworkStream.cpp d:\source binary\client\userinterface\packet.h(2792) : warning C4305: 'initializing' : truncation from '' to 'char' d:\source binary\client\userinterface\packet.h(2792) : warning C4309: 'initializing' : truncation of constant value d:\source binary\client\userinterface\packet.h(2801) : warning C4305: 'initializing' : truncation from '' to 'char' d:\source binary\client\userinterface\packet.h(2801) : warning C4309: 'initializing' : truncation of constant value .\PythonNetworkStream.cpp(649) : warning C4305: '=' : truncation from '' to 'char' .\PythonNetworkStream.cpp(649) : warning C4309: '=' : truncation of constant value PythonNetworkDatagramModule.cpp PythonNetworkDatagram.cpp PythonExceptionSender.cpp ProcessCRC.cpp .\ProcessCRC.cpp(6) : warning C4309: 'initializing' : truncation of constant value .\ProcessCRC.cpp(6) : warning C4309: 'initializing' : truncation of constant value NetworkActorManager.cpp .\NetworkActorManager.cpp(367) : warning C4800: 'BOOL' : forcing value to bool 'true' or 'false' (performance warning) .\NetworkActorManager.cpp(417) : warning C4800: 'BOOL' : forcing value to bool 'true' or 'false' (performance warning) InsultChecker.cpp AccountConnector.cpp d:\source binary\client\userinterface\Packet.h(2792) : warning C4305: 'initializing' : truncation from '' to 'char' d:\source binary\client\userinterface\Packet.h(2792) : warning C4309: 'initializing' : truncation of constant value d:\source binary\client\userinterface\Packet.h(2801) : warning C4305: 'initializing' : truncation from '' to 'char' d:\source binary\client\userinterface\Packet.h(2801) : warning C4309: 'initializing' : truncation of constant value .\AccountConnector.cpp(70) : warning C4305: '=' : truncation from '' to 'char' .\AccountConnector.cpp(70) : warning C4309: '=' : truncation of constant value .\AccountConnector.cpp(84) : warning C4305: '=' : truncation from '' to 'char' .\AccountConnector.cpp(84) : warning C4309: '=' : truncation of constant value .\AccountConnector.cpp(441) : warning C4305: '=' : truncation from '' to 'char' .\AccountConnector.cpp(441) : warning C4309: '=' : truncation of constant value .\AccountConnector.cpp(593) : warning C4305: '=' : truncation from '' to 'char' .\AccountConnector.cpp(593) : warning C4309: '=' : truncation of constant value Locale.cpp d:\source binary\client\userinterface\Packet.h(2792) : warning C4305: 'initializing' : truncation from '' to 'char' d:\source binary\client\userinterface\Packet.h(2792) : warning C4309: 'initializing' : truncation of constant value d:\source binary\client\userinterface\Packet.h(2801) : warning C4305: 'initializing' : truncation from '' to 'char' d:\source binary\client\userinterface\Packet.h(2801) : warning C4309: 'initializing' : truncation of constant value MarkManager.cpp .\MarkManager.cpp(26) : warning C4996: 'mkdir': The POSIX name for this item is deprecated. Instead, use the ISO C++ conformant name: _mkdir. See online help for details. D:\Program Files (x86)\Microsoft Visual Studio 9.0\VC\include\direct.h(128) : see declaration of 'mkdir' MarkImage.cpp .\MarkImage.cpp(190) : error C2664: 'lzo1x_decompress_safe' : cannot convert parameter 1 from 'const char *' to 'const unsigned char *' Types pointed to are unrelated; conversion requires reinterpret_cast, C-style cast or function-style cast .\MarkImage.cpp(305) : error C2664: 'lzo1x_999_compress' : cannot convert parameter 1 from 'const char *' to 'const unsigned char *' Types pointed to are unrelated; conversion requires reinterpret_cast, C-style cast or function-style cast GuildMarkUploader.cpp d:\source binary\client\userinterface\Packet.h(2792) : warning C4305: 'initializing' : truncation from '' to 'char' d:\source binary\client\userinterface\Packet.h(2792) : warning C4309: 'initializing' : truncation of constant value d:\source binary\client\userinterface\Packet.h(2801) : warning C4305: 'initializing' : truncation from '' to 'char' d:\source binary\client\userinterface\Packet.h(2801) : warning C4309: 'initializing' : truncation of constant value .\GuildMarkUploader.cpp(396) : warning C4305: '=' : truncation from '' to 'char' .\GuildMarkUploader.cpp(396) : warning C4309: '=' : truncation of constant value .\GuildMarkUploader.cpp(432) : warning C4305: '=' : truncation from '' to 'char' .\GuildMarkUploader.cpp(432) : warning C4309: '=' : truncation of constant value GuildMarkDownloader.cpp d:\source binary\client\userinterface\Packet.h(2792) : warning C4305: 'initializing' : truncation from '' to 'char' d:\source binary\client\userinterface\Packet.h(2792) : warning C4309: 'initializing' : truncation of constant value d:\source binary\client\userinterface\Packet.h(2801) : warning C4305: 'initializing' : truncation from '' to 'char' d:\source binary\client\userinterface\Packet.h(2801) : warning C4309: 'initializing' : truncation of constant value .\GuildMarkDownloader.cpp(240) : warning C4305: '=' : truncation from '' to 'char' .\GuildMarkDownloader.cpp(240) : warning C4309: '=' : truncation of constant value .\GuildMarkDownloader.cpp(442) : warning C4305: '=' : truncation from '' to 'char' .\GuildMarkDownloader.cpp(442) : warning C4309: '=' : truncation of constant value PythonSystemModule.cpp PythonSystem.cpp d:\source binary\client\userinterface\Packet.h(2792) : warning C4305: 'initializing' : truncation from '' to 'char' d:\source binary\client\userinterface\Packet.h(2792) : warning C4309: 'initializing' : truncation of constant value d:\source binary\client\userinterface\Packet.h(2801) : warning C4305: 'initializing' : truncation from '' to 'char' d:\source binary\client\userinterface\Packet.h(2801) : warning C4309: 'initializing' : truncation of constant value PythonSoundManagerModule.cpp d:\source binary\client\userinterface\Packet.h(2792) : warning C4305: 'initializing' : truncation from '' to 'char' d:\source binary\client\userinterface\Packet.h(2792) : warning C4309: 'initializing' : truncation of constant value d:\source binary\client\userinterface\Packet.h(2801) : warning C4305: 'initializing' : truncation from '' to 'char' d:\source binary\client\userinterface\Packet.h(2801) : warning C4309: 'initializing' : truncation of constant value PythonProfilerModule.cpp PythonIMEModule.cpp d:\source binary\client\userinterface\Packet.h(2792) : warning C4305: 'initializing' : truncation from '' to 'char' d:\source binary\client\userinterface\Packet.h(2792) : warning C4309: 'initializing' : truncation of constant value d:\source binary\client\userinterface\Packet.h(2801) : warning C4305: 'initializing' : truncation from '' to 'char' d:\source binary\client\userinterface\Packet.h(2801) : warning C4309: 'initializing' : truncation of constant value PythonIME.cpp Generating Code... Compiling... PythonApplicationWebPage.cpp d:\source binary\client\userinterface\Packet.h(2792) : warning C4305: 'initializing' : truncation from '' to 'char' d:\source binary\client\userinterface\Packet.h(2792) : warning C4309: 'initializing' : truncation of constant value d:\source binary\client\userinterface\Packet.h(2801) : warning C4305: 'initializing' : truncation from '' to 'char' d:\source binary\client\userinterface\Packet.h(2801) : warning C4309: 'initializing' : truncation of constant value PythonApplicationProcedure.cpp d:\source binary\client\userinterface\Packet.h(2792) : warning C4305: 'initializing' : truncation from '' to 'char' d:\source binary\client\userinterface\Packet.h(2792) : warning C4309: 'initializing' : truncation of constant value d:\source binary\client\userinterface\Packet.h(2801) : warning C4305: 'initializing' : truncation from '' to 'char' d:\source binary\client\userinterface\Packet.h(2801) : warning C4309: 'initializing' : truncation of constant value PythonApplicationModule.cpp d:\source binary\client\userinterface\Packet.h(2792) : warning C4305: 'initializing' : truncation from '' to 'char' d:\source binary\client\userinterface\Packet.h(2792) : warning C4309: 'initializing' : truncation of constant value d:\source binary\client\userinterface\Packet.h(2801) : warning C4305: 'initializing' : truncation from '' to 'char' d:\source binary\client\userinterface\Packet.h(2801) : warning C4309: 'initializing' : truncation of constant value PythonApplicationLogo.cpp d:\source binary\client\userinterface\Packet.h(2792) : warning C4305: 'initializing' : truncation from '' to 'char' d:\source binary\client\userinterface\Packet.h(2792) : warning C4309: 'initializing' : truncation of constant value d:\source binary\client\userinterface\Packet.h(2801) : warning C4305: 'initializing' : truncation from '' to 'char' d:\source binary\client\userinterface\Packet.h(2801) : warning C4309: 'initializing' : truncation of constant value .\PythonApplicationLogo.cpp(122) : error C2440: 'initializing' : cannot convert from 'byte *' to 'char *' Types pointed to are unrelated; conversion requires reinterpret_cast, C-style cast or function-style cast .\PythonApplicationLogo.cpp(126) : warning C4309: '=' : truncation of constant value .\PythonApplicationLogo.cpp(166) : error C2440: 'initializing' : cannot convert from 'byte *' to 'char *' Types pointed to are unrelated; conversion requires reinterpret_cast, C-style cast or function-style cast .\PythonApplicationLogo.cpp(170) : warning C4309: '=' : truncation of constant value PythonApplicationEvent.cpp d:\source binary\client\userinterface\Packet.h(2792) : warning C4305: 'initializing' : truncation from '' to 'char' d:\source binary\client\userinterface\Packet.h(2792) : warning C4309: 'initializing' : truncation of constant value d:\source binary\client\userinterface\Packet.h(2801) : warning C4305: 'initializing' : truncation from '' to 'char' d:\source binary\client\userinterface\Packet.h(2801) : warning C4309: 'initializing' : truncation of constant value PythonApplicationCursor.cpp d:\source binary\client\userinterface\Packet.h(2792) : warning C4305: 'initializing' : truncation from '' to 'char' d:\source binary\client\userinterface\Packet.h(2792) : warning C4309: 'initializing' : truncation of constant value d:\source binary\client\userinterface\Packet.h(2801) : warning C4305: 'initializing' : truncation from '' to 'char' d:\source binary\client\userinterface\Packet.h(2801) : warning C4309: 'initializing' : truncation of constant value PythonApplicationCamera.cpp d:\source binary\client\userinterface\Packet.h(2792) : warning C4305: 'initializing' : truncation from '' to 'char' d:\source binary\client\userinterface\Packet.h(2792) : warning C4309: 'initializing' : truncation of constant value d:\source binary\client\userinterface\Packet.h(2801) : warning C4305: 'initializing' : truncation from '' to 'char' d:\source binary\client\userinterface\Packet.h(2801) : warning C4309: 'initializing' : truncation of constant value PythonApplication.cpp d:\source binary\client\userinterface\Packet.h(2792) : warning C4305: 'initializing' : truncation from '' to 'char' d:\source binary\client\userinterface\Packet.h(2792) : warning C4309: 'initializing' : truncation of constant value d:\source binary\client\userinterface\Packet.h(2801) : warning C4305: 'initializing' : truncation from '' to 'char' d:\source binary\client\userinterface\Packet.h(2801) : warning C4309: 'initializing' : truncation of constant value ProcessScanner.cpp PythonPackModule.cpp PythonTextTailModule.cpp PythonTextTail.cpp d:\source binary\client\userinterface\Packet.h(2792) : warning C4305: 'initializing' : truncation from '' to 'char' d:\source binary\client\userinterface\Packet.h(2792) : warning C4309: 'initializing' : truncation of constant value d:\source binary\client\userinterface\Packet.h(2801) : warning C4305: 'initializing' : truncation from '' to 'char' d:\source binary\client\userinterface\Packet.h(2801) : warning C4309: 'initializing' : truncation of constant value PythonShop.cpp d:\source binary\client\userinterface\Packet.h(2792) : warning C4305: 'initializing' : truncation from '' to 'char' d:\source binary\client\userinterface\Packet.h(2792) : warning C4309: 'initializing' : truncation of constant value d:\source binary\client\userinterface\Packet.h(2801) : warning C4305: 'initializing' : truncation from '' to 'char' d:\source binary\client\userinterface\Packet.h(2801) : warning C4309: 'initializing' : truncation of constant value .\PythonShop.cpp(31) : warning C4309: 'return' : truncation of constant value .\PythonShop.cpp(330) : error C2665: 'PyTuple_GetInteger' : none of the 3 overloads could convert all the argument types d:\source binary\client\scriptlib\PythonUtils.h(6): could be 'bool PyTuple_GetInteger(PyObject *,int,unsigned char *)' d:\source binary\client\scriptlib\PythonUtils.h(7): or 'bool PyTuple_GetInteger(PyObject *,int,int *)' d:\source binary\client\scriptlib\PythonUtils.h(8): or 'bool PyTuple_GetInteger(PyObject *,int,WORD *)' while trying to match the argument list '(PyObject *, int, char *)' .\PythonShop.cpp(348) : error C2665: 'PyTuple_GetInteger' : none of the 3 overloads could convert all the argument types d:\source binary\client\scriptlib\PythonUtils.h(6): could be 'bool PyTuple_GetInteger(PyObject *,int,unsigned char *)' d:\source binary\client\scriptlib\PythonUtils.h(7): or 'bool PyTuple_GetInteger(PyObject *,int,int *)' d:\source binary\client\scriptlib\PythonUtils.h(8): or 'bool PyTuple_GetInteger(PyObject *,int,WORD *)' while trying to match the argument list '(PyObject *, int, char *)' .\PythonShop.cpp(360) : error C2665: 'PyTuple_GetInteger' : none of the 3 overloads could convert all the argument types d:\source binary\client\scriptlib\PythonUtils.h(6): could be 'bool PyTuple_GetInteger(PyObject *,int,unsigned char *)' d:\source binary\client\scriptlib\PythonUtils.h(7): or 'bool PyTuple_GetInteger(PyObject *,int,int *)' d:\source binary\client\scriptlib\PythonUtils.h(8): or 'bool PyTuple_GetInteger(PyObject *,int,WORD *)' while trying to match the argument list '(PyObject *, int, char *)' .\PythonShop.cpp(387) : error C2665: 'PyTuple_GetInteger' : none of the 3 overloads could convert all the argument types d:\source binary\client\scriptlib\PythonUtils.h(6): could be 'bool PyTuple_GetInteger(PyObject *,int,unsigned char *)' d:\source binary\client\scriptlib\PythonUtils.h(7): or 'bool PyTuple_GetInteger(PyObject *,int,int *)' d:\source binary\client\scriptlib\PythonUtils.h(8): or 'bool PyTuple_GetInteger(PyObject *,int,WORD *)' while trying to match the argument list '(PyObject *, int, char *)' .\PythonShop.cpp(396) : error C2665: 'PyTuple_GetInteger' : none of the 3 overloads could convert all the argument types d:\source binary\client\scriptlib\PythonUtils.h(6): could be 'bool PyTuple_GetInteger(PyObject *,int,unsigned char *)' d:\source binary\client\scriptlib\PythonUtils.h(7): or 'bool PyTuple_GetInteger(PyObject *,int,int *)' d:\source binary\client\scriptlib\PythonUtils.h(8): or 'bool PyTuple_GetInteger(PyObject *,int,WORD *)' while trying to match the argument list '(PyObject *, int, char *)' PythonSafeBox.cpp PythonMiniMapModule.cpp PythonMiniMap.cpp d:\source binary\client\userinterface\Packet.h(2792) : warning C4305: 'initializing' : truncation from '' to 'char' d:\source binary\client\userinterface\Packet.h(2792) : warning C4309: 'initializing' : truncation of constant value d:\source binary\client\userinterface\Packet.h(2801) : warning C4305: 'initializing' : truncation from '' to 'char' d:\source binary\client\userinterface\Packet.h(2801) : warning C4309: 'initializing' : truncation of constant value PythonMessenger.cpp PythonGuild.cpp d:\source binary\client\userinterface\Packet.h(2792) : warning C4305: 'initializing' : truncation from '' to 'char' d:\source binary\client\userinterface\Packet.h(2792) : warning C4309: 'initializing' : truncation of constant value d:\source binary\client\userinterface\Packet.h(2801) : warning C4305: 'initializing' : truncation from '' to 'char' d:\source binary\client\userinterface\Packet.h(2801) : warning C4309: 'initializing' : truncation of constant value PythonFlyModule.cpp PythonExchangeModule.cpp d:\source binary\client\userinterface\Packet.h(2792) : warning C4305: 'initializing' : truncation from '' to 'char' d:\source binary\client\userinterface\Packet.h(2792) : warning C4309: 'initializing' : truncation of constant value d:\source binary\client\userinterface\Packet.h(2801) : warning C4305: 'initializing' : truncation from '' to 'char' d:\source binary\client\userinterface\Packet.h(2801) : warning C4309: 'initializing' : truncation of constant value Generating Code... Compiling... PythonExchange.cpp d:\source binary\client\userinterface\Packet.h(2792) : warning C4305: 'initializing' : truncation from '' to 'char' d:\source binary\client\userinterface\Packet.h(2792) : warning C4309: 'initializing' : truncation of constant value d:\source binary\client\userinterface\Packet.h(2801) : warning C4305: 'initializing' : truncation from '' to 'char' d:\source binary\client\userinterface\Packet.h(2801) : warning C4309: 'initializing' : truncation of constant value PythonChatModule.cpp d:\source binary\client\userinterface\Packet.h(2792) : warning C4305: 'initializing' : truncation from '' to 'char' d:\source binary\client\userinterface\Packet.h(2792) : warning C4309: 'initializing' : truncation of constant value d:\source binary\client\userinterface\Packet.h(2801) : warning C4305: 'initializing' : truncation from '' to 'char' d:\source binary\client\userinterface\Packet.h(2801) : warning C4309: 'initializing' : truncation of constant value PythonChat.cpp d:\source binary\client\userinterface\Packet.h(2792) : warning C4305: 'initializing' : truncation from '' to 'char' d:\source binary\client\userinterface\Packet.h(2792) : warning C4309: 'initializing' : truncation of constant value d:\source binary\client\userinterface\Packet.h(2801) : warning C4305: 'initializing' : truncation from '' to 'char' d:\source binary\client\userinterface\Packet.h(2801) : warning C4309: 'initializing' : truncation of constant value PythonSkill.cpp d:\source binary\client\userinterface\Packet.h(2792) : warning C4305: 'initializing' : truncation from '' to 'char' d:\source binary\client\userinterface\Packet.h(2792) : warning C4309: 'initializing' : truncation of constant value d:\source binary\client\userinterface\Packet.h(2801) : warning C4305: 'initializing' : truncation from '' to 'char' d:\source binary\client\userinterface\Packet.h(2801) : warning C4309: 'initializing' : truncation of constant value PythonQuest.cpp PythonPlayerSkill.cpp d:\source binary\client\userinterface\Packet.h(2792) : warning C4305: 'initializing' : truncation from '' to 'char' d:\source binary\client\userinterface\Packet.h(2792) : warning C4309: 'initializing' : truncation of constant value d:\source binary\client\userinterface\Packet.h(2801) : warning C4305: 'initializing' : truncation from '' to 'char' d:\source binary\client\userinterface\Packet.h(2801) : warning C4309: 'initializing' : truncation of constant value PythonPlayerModule.cpp d:\source binary\client\userinterface\Packet.h(2792) : warning C4305: 'initializing' : truncation from '' to 'char' d:\source binary\client\userinterface\Packet.h(2792) : warning C4309: 'initializing' : truncation of constant value d:\source binary\client\userinterface\Packet.h(2801) : warning C4305: 'initializing' : truncation from '' to 'char' d:\source binary\client\userinterface\Packet.h(2801) : warning C4309: 'initializing' : truncation of constant value .\PythonPlayerModule.cpp(770) : error C2664: 'PyTuple_GetByte' : cannot convert parameter 3 from 'char *' to 'unsigned char *' Types pointed to are unrelated; conversion requires reinterpret_cast, C-style cast or function-style cast .\PythonPlayerModule.cpp(774) : error C2664: 'PyTuple_GetByte' : cannot convert parameter 3 from 'char *' to 'unsigned char *' Types pointed to are unrelated; conversion requires reinterpret_cast, C-style cast or function-style cast .\PythonPlayerModule.cpp(812) : error C2664: 'PyTuple_GetByte' : cannot convert parameter 3 from 'char *' to 'unsigned char *' Types pointed to are unrelated; conversion requires reinterpret_cast, C-style cast or function-style cast .\PythonPlayerModule.cpp(842) : error C2664: 'PyTuple_GetByte' : cannot convert parameter 3 from 'char *' to 'unsigned char *' Types pointed to are unrelated; conversion requires reinterpret_cast, C-style cast or function-style cast .\PythonPlayerModule.cpp(873) : error C2664: 'PyTuple_GetByte' : cannot convert parameter 3 from 'char *' to 'unsigned char *' Types pointed to are unrelated; conversion requires reinterpret_cast, C-style cast or function-style cast .\PythonPlayerModule.cpp(900) : error C2665: 'PyTuple_GetInteger' : none of the 3 overloads could convert all the argument types d:\source binary\client\scriptlib\PythonUtils.h(6): could be 'bool PyTuple_GetInteger(PyObject *,int,unsigned char *)' d:\source binary\client\scriptlib\PythonUtils.h(7): or 'bool PyTuple_GetInteger(PyObject *,int,int *)' d:\source binary\client\scriptlib\PythonUtils.h(8): or 'bool PyTuple_GetInteger(PyObject *,int,WORD *)' while trying to match the argument list '(PyObject *, int, char *)' .\PythonPlayerModule.cpp(912) : error C2664: 'PyTuple_GetByte' : cannot convert parameter 3 from 'char *' to 'unsigned char *' Types pointed to are unrelated; conversion requires reinterpret_cast, C-style cast or function-style cast .\PythonPlayerModule.cpp(919) : error C2665: 'PyTuple_GetInteger' : none of the 3 overloads could convert all the argument types d:\source binary\client\scriptlib\PythonUtils.h(6): could be 'bool PyTuple_GetInteger(PyObject *,int,unsigned char *)' d:\source binary\client\scriptlib\PythonUtils.h(7): or 'bool PyTuple_GetInteger(PyObject *,int,int *)' d:\source binary\client\scriptlib\PythonUtils.h(8): or 'bool PyTuple_GetInteger(PyObject *,int,WORD *)' while trying to match the argument list '(PyObject *, int, char *)' .\PythonPlayerModule.cpp(958) : error C2664: 'PyTuple_GetByte' : cannot convert parameter 3 from 'char *' to 'unsigned char *' Types pointed to are unrelated; conversion requires reinterpret_cast, C-style cast or function-style cast .\PythonPlayerModule.cpp(991) : error C2664: 'PyTuple_GetByte' : cannot convert parameter 3 from 'char *' to 'unsigned char *' Types pointed to are unrelated; conversion requires reinterpret_cast, C-style cast or function-style cast .\PythonPlayerModule.cpp(1021) : error C2664: 'PyTuple_GetByte' : cannot convert parameter 3 from 'char *' to 'unsigned char *' Types pointed to are unrelated; conversion requires reinterpret_cast, C-style cast or function-style cast .\PythonPlayerModule.cpp(1083) : error C2664: 'PyTuple_GetByte' : cannot convert parameter 3 from 'char *' to 'unsigned char *' Types pointed to are unrelated; conversion requires reinterpret_cast, C-style cast or function-style cast .\PythonPlayerModule.cpp(1294) : error C2665: 'PyTuple_GetInteger' : none of the 3 overloads could convert all the argument types d:\source binary\client\scriptlib\PythonUtils.h(6): could be 'bool PyTuple_GetInteger(PyObject *,int,unsigned char *)' d:\source binary\client\scriptlib\PythonUtils.h(7): or 'bool PyTuple_GetInteger(PyObject *,int,int *)' d:\source binary\client\scriptlib\PythonUtils.h(8): or 'bool PyTuple_GetInteger(PyObject *,int,WORD *)' while trying to match the argument list '(PyObject *, int, char *)' .\PythonPlayerModule.cpp(1340) : error C2665: 'PyTuple_GetInteger' : none of the 3 overloads could convert all the argument types d:\source binary\client\scriptlib\PythonUtils.h(6): could be 'bool PyTuple_GetInteger(PyObject *,int,unsigned char *)' d:\source binary\client\scriptlib\PythonUtils.h(7): or 'bool PyTuple_GetInteger(PyObject *,int,int *)' d:\source binary\client\scriptlib\PythonUtils.h(8): or 'bool PyTuple_GetInteger(PyObject *,int,WORD *)' while trying to match the argument list '(PyObject *, int, char *)' .\PythonPlayerModule.cpp(1393) : error C2665: 'PyTuple_GetInteger' : none of the 3 overloads could convert all the argument types d:\source binary\client\scriptlib\PythonUtils.h(6): could be 'bool PyTuple_GetInteger(PyObject *,int,unsigned char *)' d:\source binary\client\scriptlib\PythonUtils.h(7): or 'bool PyTuple_GetInteger(PyObject *,int,int *)' d:\source binary\client\scriptlib\PythonUtils.h(8): or 'bool PyTuple_GetInteger(PyObject *,int,WORD *)' while trying to match the argument list '(PyObject *, int, char *)' .\PythonPlayerModule.cpp(1456) : error C2665: 'PyTuple_GetInteger' : none of the 3 overloads could convert all the argument types d:\source binary\client\scriptlib\PythonUtils.h(6): could be 'bool PyTuple_GetInteger(PyObject *,int,unsigned char *)' d:\source binary\client\scriptlib\PythonUtils.h(7): or 'bool PyTuple_GetInteger(PyObject *,int,int *)' d:\source binary\client\scriptlib\PythonUtils.h(8): or 'bool PyTuple_GetInteger(PyObject *,int,WORD *)' while trying to match the argument list '(PyObject *, int, char *)' .\PythonPlayerModule.cpp(1531) : error C2665: 'PyTuple_GetInteger' : none of the 3 overloads could convert all the argument types d:\source binary\client\scriptlib\PythonUtils.h(6): could be 'bool PyTuple_GetInteger(PyObject *,int,unsigned char *)' d:\source binary\client\scriptlib\PythonUtils.h(7): or 'bool PyTuple_GetInteger(PyObject *,int,int *)' d:\source binary\client\scriptlib\PythonUtils.h(8): or 'bool PyTuple_GetInteger(PyObject *,int,WORD *)' while trying to match the argument list '(PyObject *, int, char *)' .\PythonPlayerModule.cpp(1616) : error C2665: 'PyTuple_GetInteger' : none of the 3 overloads could convert all the argument types d:\source binary\client\scriptlib\PythonUtils.h(6): could be 'bool PyTuple_GetInteger(PyObject *,int,unsigned char *)' d:\source binary\client\scriptlib\PythonUtils.h(7): or 'bool PyTuple_GetInteger(PyObject *,int,int *)' d:\source binary\client\scriptlib\PythonUtils.h(8): or 'bool PyTuple_GetInteger(PyObject *,int,WORD *)' while trying to match the argument list '(PyObject *, int, char *)' .\PythonPlayerModule.cpp(1673) : error C2665: 'PyTuple_GetInteger' : none of the 3 overloads could convert all the argument types d:\source binary\client\scriptlib\PythonUtils.h(6): could be 'bool PyTuple_GetInteger(PyObject *,int,unsigned char *)' d:\source binary\client\scriptlib\PythonUtils.h(7): or 'bool PyTuple_GetInteger(PyObject *,int,int *)' d:\source binary\client\scriptlib\PythonUtils.h(8): or 'bool PyTuple_GetInteger(PyObject *,int,WORD *)' while trying to match the argument list '(PyObject *, int, char *)' .\PythonPlayerModule.cpp(1713) : error C2665: 'PyTuple_GetInteger' : none of the 3 overloads could convert all the argument types d:\source binary\client\scriptlib\PythonUtils.h(6): could be 'bool PyTuple_GetInteger(PyObject *,int,unsigned char *)' d:\source binary\client\scriptlib\PythonUtils.h(7): or 'bool PyTuple_GetInteger(PyObject *,int,int *)' d:\source binary\client\scriptlib\PythonUtils.h(8): or 'bool PyTuple_GetInteger(PyObject *,int,WORD *)' while trying to match the argument list '(PyObject *, int, char *)' .\PythonPlayerModule.cpp(1976) : error C2665: 'PyTuple_GetInteger' : none of the 3 overloads could convert all the argument types d:\source binary\client\scriptlib\PythonUtils.h(6): could be 'bool PyTuple_GetInteger(PyObject *,int,unsigned char *)' d:\source binary\client\scriptlib\PythonUtils.h(7): or 'bool PyTuple_GetInteger(PyObject *,int,int *)' d:\source binary\client\scriptlib\PythonUtils.h(8): or 'bool PyTuple_GetInteger(PyObject *,int,WORD *)' while trying to match the argument list '(PyObject *, int, char *)' .\PythonPlayerModule.cpp(2017) : error C2665: 'PyTuple_GetInteger' : none of the 3 overloads could convert all the argument types d:\source binary\client\scriptlib\PythonUtils.h(6): could be 'bool PyTuple_GetInteger(PyObject *,int,unsigned char *)' d:\source binary\client\scriptlib\PythonUtils.h(7): or 'bool PyTuple_GetInteger(PyObject *,int,int *)' d:\source binary\client\scriptlib\PythonUtils.h(8): or 'bool PyTuple_GetInteger(PyObject *,int,WORD *)' while trying to match the argument list '(PyObject *, int, char *)' .\PythonPlayerModule.cpp(2130) : error C2664: 'PyTuple_GetByte' : cannot convert parameter 3 from 'char *' to 'unsigned char *' Types pointed to are unrelated; conversion requires reinterpret_cast, C-style cast or function-style cast .\PythonPlayerModule.cpp(2152) : error C2664: 'PyTuple_GetByte' : cannot convert parameter 3 from 'char *' to 'unsigned char *' Types pointed to are unrelated; conversion requires reinterpret_cast, C-style cast or function-style cast PythonPlayerInputMouse.cpp d:\source binary\client\userinterface\Packet.h(2792) : warning C4305: 'initializing' : truncation from '' to 'char' d:\source binary\client\userinterface\Packet.h(2792) : warning C4309: 'initializing' : truncation of constant value d:\source binary\client\userinterface\Packet.h(2801) : warning C4305: 'initializing' : truncation from '' to 'char' d:\source binary\client\userinterface\Packet.h(2801) : warning C4309: 'initializing' : truncation of constant value PythonPlayerInputKeyboard.cpp d:\source binary\client\userinterface\Packet.h(2792) : warning C4305: 'initializing' : truncation from '' to 'char' d:\source binary\client\userinterface\Packet.h(2792) : warning C4309: 'initializing' : truncation of constant value d:\source binary\client\userinterface\Packet.h(2801) : warning C4305: 'initializing' : truncation from '' to 'char' d:\source binary\client\userinterface\Packet.h(2801) : warning C4309: 'initializing' : truncation of constant value PythonPlayerInput.cpp d:\source binary\client\userinterface\Packet.h(2792) : warning C4305: 'initializing' : truncation from '' to 'char' d:\source binary\client\userinterface\Packet.h(2792) : warning C4309: 'initializing' : truncation of constant value d:\source binary\client\userinterface\Packet.h(2801) : warning C4305: 'initializing' : truncation from '' to 'char' d:\source binary\client\userinterface\Packet.h(2801) : warning C4309: 'initializing' : truncation of constant value PythonPlayerEventHandler.cpp d:\source binary\client\userinterface\packet.h(2792) : warning C4305: 'initializing' : truncation from '' to 'char' d:\source binary\client\userinterface\packet.h(2792) : warning C4309: 'initializing' : truncation of constant value d:\source binary\client\userinterface\packet.h(2801) : warning C4305: 'initializing' : truncation from '' to 'char' d:\source binary\client\userinterface\packet.h(2801) : warning C4309: 'initializing' : truncation of constant value PythonPlayer.cpp d:\source binary\client\userinterface\packet.h(2792) : warning C4305: 'initializing' : truncation from '' to 'char' d:\source binary\client\userinterface\packet.h(2792) : warning C4309: 'initializing' : truncation of constant value d:\source binary\client\userinterface\packet.h(2801) : warning C4305: 'initializing' : truncation from '' to 'char' d:\source binary\client\userinterface\packet.h(2801) : warning C4309: 'initializing' : truncation of constant value PythonNonPlayerModule.cpp PythonNonPlayer.cpp PythonItemModule.cpp PythonItem.cpp PythonGameEventManagerModule.cpp PythonEventManagerMoudle.cpp d:\source binary\client\userinterface\packet.h(2792) : warning C4305: 'initializing' : truncation from '' to 'char' d:\source binary\client\userinterface\packet.h(2792) : warning C4309: 'initializing' : truncation of constant value d:\source binary\client\userinterface\packet.h(2801) : warning C4305: 'initializing' : truncation from '' to 'char' d:\source binary\client\userinterface\packet.h(2801) : warning C4309: 'initializing' : truncation of constant value PythonEventManager.cpp d:\source binary\client\userinterface\packet.h(2792) : warning C4305: 'initializing' : truncation from '' to 'char' d:\source binary\client\userinterface\packet.h(2792) : warning C4309: 'initializing' : truncation of constant value d:\source binary\client\userinterface\packet.h(2801) : warning C4305: 'initializing' : truncation from '' to 'char' d:\source binary\client\userinterface\packet.h(2801) : warning C4309: 'initializing' : truncation of constant value PythonEffectModule.cpp Generating Code... Compiling... PythonCharacterModule.cpp PythonCharacterManagerModule.cpp PythonCharacterManager.cpp d:\source binary\client\userinterface\packet.h(2792) : warning C4305: 'initializing' : truncation from '' to 'char' d:\source binary\client\userinterface\packet.h(2792) : warning C4309: 'initializing' : truncation of constant value d:\source binary\client\userinterface\packet.h(2801) : warning C4305: 'initializing' : truncation from '' to 'char' d:\source binary\client\userinterface\packet.h(2801) : warning C4309: 'initializing' : truncation of constant value PythonBackgroundModule.cpp PythonBackground.cpp d:\source binary\client\userinterface\packet.h(2792) : warning C4305: 'initializing' : truncation from '' to 'char' d:\source binary\client\userinterface\packet.h(2792) : warning C4309: 'initializing' : truncation of constant value d:\source binary\client\userinterface\packet.h(2801) : warning C4305: 'initializing' : truncation from '' to 'char' d:\source binary\client\userinterface\packet.h(2801) : warning C4309: 'initializing' : truncation of constant value CameraProcedure.cpp InstanceBaseTransform.cpp InstanceBaseMovement.cpp InstanceBaseMotion.cpp InstanceBaseEvent.cpp InstanceBaseEffect.cpp d:\source binary\client\userinterface\Packet.h(2792) : warning C4305: 'initializing' : truncation from '' to 'char' d:\source binary\client\userinterface\Packet.h(2792) : warning C4309: 'initializing' : truncation of constant value d:\source binary\client\userinterface\Packet.h(2801) : warning C4305: 'initializing' : truncation from '' to 'char' d:\source binary\client\userinterface\Packet.h(2801) : warning C4309: 'initializing' : truncation of constant value InstanceBaseBattle.cpp InstanceBase.cpp d:\source binary\client\userinterface\Packet.h(2792) : warning C4305: 'initializing' : truncation from '' to 'char' d:\source binary\client\userinterface\Packet.h(2792) : warning C4309: 'initializing' : truncation of constant value d:\source binary\client\userinterface\Packet.h(2801) : warning C4305: 'initializing' : truncation from '' to 'char' d:\source binary\client\userinterface\Packet.h(2801) : warning C4309: 'initializing' : truncation of constant value .\InstanceBase.cpp(2854) : warning C4309: 'initializing' : truncation of constant value .\InstanceBase.cpp(2855) : warning C4309: 'initializing' : truncation of constant value Generating Code... Creating browse information file... Microsoft Browse Information Maintenance Utility Version 9.00.21022 Copyright (C) Microsoft Corporation. All rights reserved. Results Build log was saved at "file://d:\Source Binary\Client\UserInterface\Release\BuildLog.htm" UserInterface - 46 error(s), 254 warning(s) Please Help
  2. Hey there, I have a problem to compile the Client binary Error: " Error 1 fatal error LNK1257: code generation failed UserInterface UserInterface" Edit: 1>------ Build started: Project: UserInterface, Configuration: Release Win32 ------ 1>Linking... 1>fatal error C1900: Il mismatch between 'P1' version '20080116' and 'P2' version '20070207' 1>LINK : fatal error LNK1257: code generation failed 1>Build log was saved at "file://d:\Downloads\MEGA\kraizy\mainline_released\mainline_sg\Srcs\Client\UserInterface\Release\BuildLog.htm" 1>UserInterface - 1 error(s), 0 warning(s) ========== Build: 0 succeeded, 1 failed, 15 up-to-date, 0 skipped ========== Can someone help me? Thanks Thunder
×
×
  • Create New...

Important Information

Terms of Use / Privacy Policy / Guidelines / We have placed cookies on your device to help make this website better. You can adjust your cookie settings, otherwise we'll assume you're okay to continue.