Jump to content
×
×
  • Create New...

snapkode

Newbie
  • Posts

    16
  • Joined

  • Last visited

About snapkode

Recent Profile Visitors

The recent visitors block is disabled and is not being shown to other users.

snapkode's Achievements

Apprentice

Apprentice (3/14)

  • Dedicated Rare
  • Week One Done
  • Collaborator
  • Reacting Well
  • Conversation Starter

Recent Badges

0

Reputation

  1. Anyone have enigma protector cracked ? Without the publicity , thanks!
  2. compiled on your vdi and uploaded in my dedicat server (64bit) download all the necessary lib now when I start server from console auth online dB online game online when I try to login into the client in console appear that error, Dó you know because ? @ TMP4
  3. @ TMP4 If I want to put that on a Dedicated server, 16gbram , FreeBSD 12.2 64bit , that work ? And how I can must do that ? Upload compiled game/dB and start the server ?
  4. Now I have only this errors : ld: error: /usr/local/lib/libgtest.so is incompatible with elf_i386_fbsd
  5. Cancelled all hackshield files/inc from source, same error linking ../game.... ld: error: unable to find library -lanticpxsvr clang++: error: linker command failed with exit code 1 (use -v to see invocation) gmake: *** [Makefile:129: ../game] Error 1
  6. Changed in false now appear that linking ../game.... ld: error: unable to find library -lanticpxsvr clang++: error: linker command failed with exit code 1 (use -v to see invocation) gmake: *** [Makefile:129: ../game] Error 1
  7. Ok done. The Fatal errore doesn't appear,thank you, now I have this : DragonSoul.cpp:385:11: error: cannot initialize return object of type 'bool' with an rvalue of type 'nullptr_t' return NULL; ^~~~ /usr/include/sys/_null.h:37:14: note: expanded from macro 'NULL' #define NULL nullptr ^~~~~~~ 1 error generated.
  8. You mean tu delete string from file ?
  9. When i go to compile game source i get that error : cipher.cpp:32:10: fatal error: 'cryptopp/cryptoppLibLink.h' file not found #include <cryptopp/cryptoppLibLink.h> ^~~~~~~~~~~~~~~~~~~~~~~~~~~~ 1 error generated. gmake: *** [Makefile:120: OBJDIR/cipher.o] Error 1 gmake: *** Waiting for unfinished jobs.... compile minilzo.c DragonSoul.cpp:385:11: error: cannot initialize return object of type 'bool' with an rvalue of type 'nullptr_t' return NULL; ^~~~ /usr/include/sys/_null.h:37:14: note: expanded from macro 'NULL' #define NULL nullptr ^~~~~~~ 1 error generated. gmake: *** [Makefile:120: OBJDIR/DragonSoul.o] Error 1 CryptoPP already installed, any solution?
  10. Yes IP correct, ssh enabled when i get that / sanity check on sshd / when i try to connect with WinSCP get me that error > Network Error : Software caused connection abbort
  11. Performing sanity of … sshd - i receive that in console And i cant connect with ftp/sftp
  12. serverfile TMP4 how i can solve that error ?

Important Information

Terms of Use / Privacy Policy / Guidelines / We have placed cookies on your device to help make this website better. You can adjust your cookie settings, otherwise we'll assume you're okay to continue.