Jump to content

dharokko

Member
  • Content Count

    18
  • Joined

  • Last visited

  • Yangs

    41 [ Donate ]

Community Reputation

1 Neutral

About dharokko

  • Rank
    Neutral

Informations

  • Gender
    Male

Recent Profile Visitors

The recent visitors block is disabled and is not being shown to other users.

  1. UP I need the same thing, but dl is down.. just for locale_de https://mega.nz/#!d51V0aKA!tQeYXTpuA36Y0D98yUo_5EkSeQpJ31xZzjoM_AHsN84
  2. 1 % is metin2 99% Playing with unreal engine or unity.. dude.. you just take the Metin2 Modell-(Mesh) and the Animations... is from MIXAMO.. https://www.mixamo.com/#/ I think your "Project" will never come Online. If some other guys want to create the same shit..
  3. Thx for your feedback, i will rework it.
  4. **New Halloween 2018 Weapons** Without Claw! Just for Granny 2.11.8.0 + User! Price: 15€ Skype: Dharokko18@web.de SPECIAL EDITION
  5. can you create a code methode for vs 2008? The src db part is just for 2011. ClientManager.cpp: In member function 'void CClientManager::SendPartyOnSetup(CPeer*)': ClientManager.cpp:424: error: a function-definition is not allowed here before ':' token ClientManager.cpp:424: error: expected primary-expression before ')' token ClientManager.cpp:424: error: expected `;' before ')' token ClientManager.cpp:426: error: 'channels' was not declared in this scope ClientManagerParty.cpp:8: error: function definition does not declare parameters ClientManagerParty.cpp: In member function 'void CClientManager::QUERY_PARTY_CREATE(CPeer*, TPacketPartyCreate*)': ClientManagerParty.cpp:13: error: a function-definition is not allowed here before ':' token ClientManagerParty.cpp:239: error: expected primary-expression at end of input ClientManagerParty.cpp:239: error: expected `;' at end of input ClientManagerParty.cpp:239: error: expected primary-expression at end of input ClientManagerParty.cpp:239: error: expected `)' at end of input ClientManagerParty.cpp:239: error: expected statement at end of input ClientManagerParty.cpp:239: error: expected `}' at end of input
  6. I'm searching this guild storage system. https://akami.bz/build/img/misc/guildstorage.webm
  7. can u tell us you'r index numbers? For costume and inventory. Belt don't work for me
  8. where is it? I also need applytype3.
  9. 1120 19:45:03917 :: CPythonItem::LoadItemTable: invalid item_proto[locale/de/item_proto] STRIDE[188] != sizeof(SItemTable) 1120 19:45:03917 :: LoadLocaleData - LoadItemProto(locale/de/item_proto) Error 1120 19:45:13785 :: Traceback (most recent call last): 1120 19:45:13785 :: File "networkModule.py", line 239, in SetGamePhase 1120 19:45:13786 :: File "game.py", line 115, in __init__ 1120 19:45:13786 :: File "interfaceModule.py", line 294, in MakeInterface 1120 19:45:13786 :: File "interfaceModule.py", line 129, in __MakeTaskBar 1120 19:45:13786 :: File "uiTaskBar.py", line 553, in LoadWindow 1120 19:45:13786 :: File "uiTaskBar.py", line 765, in RefreshQuickSlot 1120 19:45:13786 :: RuntimeError 1120 19:45:13786 :: : 1120 19:45:13786 :: skill.GetSkillType - Failed to find skill by 2 1120 19:45:13786 ::
  10. how? Have the same problem...
×
×
  • Create New...

Important Information

Terms of Use / Privacy Policy / Guidelines / We have placed cookies on your device to help make this website better. You can adjust your cookie settings, otherwise we'll assume you're okay to continue.